program: Gaussian 09
title: 000095795
version: EM64L-G09RevD.01
frameworkgroup: C1[X(C7H6N2O4)]
method: RPBEPBE
basis: SDD
operation: Freq
keyword: #pfreq=noraman
keyword: PBEPBE/SDD
title: #p freq=noraman PBEPBE/SDD
converged: YES YES NO NO
title: Mulliken charges:
elementType: O O O O N N C C C C C C C H H H H H H
charge: -0.415034 -0.304558 -0.190373 -0.187287 0.018399 -0.680494 0.002934 0.361620 0.357108 -0.383758 -0.410526 -0.178689 0.174559 0.274612 0.232345 0.240517 0.313170 0.382027 0.393427
chargesum: 0.00000
title: Mulliken charges with hydrogens summed into heavy atoms:
elementType: O O O O N N C C C C C C C
charge: -0.021607 -0.304558 -0.190373 -0.187287 0.018399 0.014702 0.002934 0.361620 0.357108 -0.109146 -0.178181 0.061828 0.174559
polarizability: 1.40777518e+02 -3.02220181e+00 1.33203283e+02 -6.12608682e+00 -7.55257766e+00 5.39059196e+01
1716.lowfreq: -9.0962 -7.7804 -1.4611 -0.0010 -0.0007 -0.0006 44.2481 94.5033 105.8118
frequency: 44.2466 94.5029 105.8107 163.8445 196.3485 222.5717 265.3327 319.0806 370.1695 383.6548 418.4289 478.7581 485.2558 506.4883 544.9542 560.7865 615.1414 633.8302 669.2589 696.3067 726.4355 727.8929 772.2373 788.0389 810.8188 886.3030 933.7742 976.9967 1021.0674 1044.6992 1096.3128 1155.2822 1176.1770 1210.0541 1236.1858 1338.5452 1344.4080 1386.0137 1408.4236 1447.5094 1479.5091 1546.1749 1575.5987 1627.9603 1638.5998 3136.0372 3161.4540 3190.4593 3408.1605 3541.3662 3647.9568
redmass: 10.9358 7.7336 11.0244 5.6546 9.7792 4.4637 5.3380 9.2221 7.2933 4.5918 6.4759 1.2370 2.7174 3.4484 6.8763 1.3661 4.9538 5.1823 4.4314 4.8319 4.0483 1.6362 1.8565 6.2164 2.4293 1.4515 5.5220 1.3463 5.8893 1.9276 1.7178 1.7694 1.2065 2.1869 5.5081 2.3602 2.9058 12.6733 6.2232 3.4221 3.1254 3.5784 6.0234 1.7916 4.5225 1.0881 1.0947 1.0961 1.0562 1.0644 1.0945
irintensity: 1.1042 0.4375 1.0015 1.5919 2.5020 6.4405 3.1529 1.0943 6.9697 17.1287 5.0346 93.1999 7.5925 10.7798 2.5181 107.8185 11.0364 32.9299 32.3910 19.5647 82.6397 122.2608 23.1239 6.7443 59.7177 1.0575 3.6929 1.8554 141.5245 91.0457 3.3587 111.0940 5.9921 27.4689 162.5692 2.7800 141.7495 167.5243 4.3265 3.7842 56.8897 186.5141 134.1412 171.0989 213.3988 6.8173 15.2784 1.5263 116.3901 68.7435 59.8720
temp: 298.150 k
press: 1.00000 atm
elementType: 8 8 8 8 7 7 6 6 6 6 6 6 6 1 1 1 1 1 1
symmnumber: 1
zpe: 342223.0 jmol-1
zpe.correction: 0.130346 hartree
zpe.thermalcorrener: 0.141441 hartree
zpe.thermalcorrenthalpy: 0.142385 hartree
zpe.thermalcorrgfe: 0.093111 hartree
zpe.sumelectzpe: -679.737615 hartree
zpe.sumelectthermal: -679.726519 hartree
zpe.sumelectthermalent: -679.725575 hartree
zpe.sumelectthermalfe: -679.774850 hartree
dipole: -5.4450 1.8083 -0.6956
dipole: 5.7794
quadrupole: -71.7549 -63.0520 -79.1832
quadrupole: -6.1212 -0.3478 3.9205
quadrupole: -0.4249 8.2781 -7.8532 -6.1212 -0.3478 3.9205
hfenergy: -679.8679604 hartree
pointgroup: C01 [X(C7H6N2O4)]
dipole: 2.2542809 0.2851979 0.0837684 debye
dipolederiv: -1.0043063 -0.2964256 0.3702084 -0.1992253 -0.3484001 0.1372149 0.3969043 0.2679483 -0.5856825 -0.538362 0.1658345 0.1553403 0.1181149 -1.1103474 -0.0987458 0.1418716 -0.0061326 -0.4389761 -0.6965748 0.1596108 0.188475 0.1448185 -0.3542083 -0.2468003 0.0793031 -0.1863593 -0.4814939 -0.6162398 -0.116469 -0.1407293 -0.1214314 -0.4116474 -0.2528275 -0.0587267 -0.2574665 -0.5296194 1.437992 0.0029927 -0.0502055 0.0689676 0.4993356 0.5430139 -0.0862907 0.4259938 0.8309257 -0.8325096 0.4608741 0.0866309 0.7437797 -0.7148147 -0.049818 0.0415734 -0.0230139 -0.6450464 -0.3626429 0.1384429 0.0844718 -0.4723178 -0.8334213 0.1109506 -0.0229628 -0.006271 -0.0883347 -0.2174688 -0.2728235 0.0546858 0.0515225 0.6729493 -0.1172147 0.1288737 0.065444 0.0095941 0.6946204 -0.4779502 -0.1133771 -0.9573135 0.6126476 0.1223036 -0.1704512 0.0006719 0.1835461 -0.3197376 -0.2302856 0.0165836 -0.1197008 -0.3961771 0.0298205 0.1044239 0.04473 -0.158941 0.0414707 -0.0222949 -0.0410623 0.5258428 -0.22465 -0.0530583 0.0147107 0.0026729 -0.201204 0.4016586 0.2307933 -0.0516485 -0.076249 0.1472207 0.0250283 -0.050987 0.0070071 -0.0872444 1.1508462 0.2762479 -0.5912165 0.3363702 1.7434814 -0.1088754 -0.50956 -0.2040599 0.57659 0.041151 0.0554977 0.0078105 0.0365089 0.0573217 0.0090657 -0.0297788 -0.0226936 0.1737814 -0.1021019 -0.0367234 0.0293864 0.0196336 0.0765639 -0.0020486 0.035098 -0.0089683 0.163608 0.0674272 -0.055908 0.0017753 -0.0710948 -0.0650685 0.0000201 -0.0019467 0.0011571 0.1525888 0.2213465 -0.0622721 0.0050798 -0.0794249 0.1738116 -0.0052998 0.0109764 0.0105047 0.367055 0.2795971 0.0088552 -0.0249948 0.0095872 0.313664 -0.0229123 0.00206 -0.0099415 0.3716184 0.3538341 0.0720032 0.0127861 0.0416116 0.1617391 -0.0198169 -0.0250912 -0.1012234 0.387235 unknown
polarizability: 140.3311134|1.7419758|132.7309381|-11.6247409|6.4138403|54.8246692 unknown
InChI: InChI=1S/C7H6N2O4/c8-4-2-1-3-5(9(12)13)6(4)7(10)11/h1-3,10H,8H2
charge 0 multiplicity 1
19 atoms
O  -1.206611 -1.915499 0.937084
O  0.683173 -2.820877 -0.039209
O  -2.662296 1.241388 0.827114
O  -2.400969 -0.224075 -0.903607
N  -1.939172 0.545312 0.018228
N  2.750022 -1.144346 -0.255213
C  0.424313 -0.399123 0.043069
C  -0.460423 0.718191 0.100101
C  1.83412 -0.12647 -0.125904
C  -0.019584 2.046988 0.104905
C  2.279944 1.237636 -0.129785
C  1.374823 2.293803 0.003828
C  0.00052 -1.79471 0.260852
H  -0.745186 2.861647 0.156909
H  3.351492 1.439456 -0.239349
H  1.739926 3.325847 0.002327
H  3.744501 -0.937496 -0.30083
H  2.404178 -2.109806 -0.313222
H  -1.453972 -2.875266 1.011902
