program: Gaussian 09
title: 000095791
version: EM64L-G09RevD.01
frameworkgroup: C1[X(C5H10Cl2N2O)]
method: RPBEPBE
basis: SDD
operation: Freq
keyword: #p
keyword: freq=noraman
keyword: PBEPBE/SDD
title: #p freq=noraman PBEPBE/SDD
converged: YES YES NO NO
title: Mulliken charges:
elementType: Cl Cl O N N C C C C C H H H H H H H H H H
charge: -0.084541 -0.084539 -0.324474 -0.393336 -0.393318 -0.325016 -0.325102 0.321123 -0.550040 -0.550002 0.268928 0.241634 0.241647 0.268926 0.299927 0.299924 0.266470 0.277656 0.277665 0.266469
chargesum: 0.00000
title: Mulliken charges with hydrogens summed into heavy atoms:
elementType: Cl Cl O N N C C C C C
charge: -0.084541 -0.084539 -0.324474 -0.093409 -0.093394 0.185546 0.185471 0.321123 -0.005914 -0.005868
polarizability: 1.08567931e+02 5.94078938e-03 9.67746378e+01 -2.20947751e-03 1.18451122e+01 6.24386429e+01
1716.lowfreq: -16.5776 -10.5466 -5.9709 -0.0021 -0.0007 0.0014 9.5202 27.5317 51.6234
frequency: 5.1142 27.5234 51.6225 82.7458 96.3068 117.0609 174.1163 242.4045 277.4617 342.2294 387.4433 408.1500 471.5706 492.8617 572.9167 589.7146 600.9741 671.2314 710.2318 821.3280 848.6873 949.6557 966.5229 992.8976 1017.2819 1048.9220 1104.1655 1151.7307 1163.2378 1199.1089 1213.8926 1238.0980 1244.2765 1294.1366 1299.1012 1366.9505 1372.0330 1438.9218 1438.9980 1444.8376 1449.0410 1465.7606 1516.2635 1626.5940 2989.2914 2990.5936 3048.3266 3048.8551 3064.5853 3064.7972 3153.4416 3153.5828 3544.1144 3552.1095
redmass: 4.5238 7.9248 6.5442 6.9874 4.3127 3.1507 8.1424 5.2763 2.2519 2.0397 1.4113 3.0119 2.6034 2.7296 1.3736 4.3247 3.3070 4.0870 9.8488 1.9203 1.9844 2.1105 2.2084 2.4086 1.5408 1.9231 3.6799 1.5217 1.2446 1.9277 1.2309 1.3576 1.5657 1.1695 1.1923 1.2933 1.3240 1.1058 1.1140 1.1722 1.0799 1.4538 2.4693 5.1117 1.0599 1.0602 1.0970 1.0966 1.0613 1.0615 1.1120 1.1119 1.0777 1.0770
irintensity: 0.0583 1.0651 5.9544 12.0703 19.2893 3.5076 3.9617 4.2186 3.1224 32.8062 2.6845 3.1235 10.9548 17.2134 229.7150 7.7307 92.4299 12.4624 9.0150 15.6497 6.5434 20.3216 11.4543 15.7500 0.7728 3.5144 13.2353 1.1920 2.3158 10.6795 0.9222 5.6993 285.0021 43.2470 56.4965 3.6467 3.1021 3.6421 16.6055 72.8935 3.4516 12.1991 596.8998 170.0474 83.6323 17.8083 0.0771 13.2665 12.8788 32.7421 23.7141 8.1384 18.2929 29.1229
temp: 298.150 k
press: 1.00000 atm
elementType: 17 17 8 7 7 6 6 6 6 6 1 1 1 1 1 1 1 1 1 1
symmnumber: 1
zpe: 410342.0 jmol-1
zpe.correction: 0.156291 hartree
zpe.thermalcorrener: 0.168265 hartree
zpe.thermalcorrenthalpy: 0.169209 hartree
zpe.thermalcorrgfe: 0.113188 hartree
zpe.sumelectzpe: -1300.600147 hartree
zpe.sumelectthermal: -1300.588173 hartree
zpe.sumelectthermalent: -1300.587229 hartree
zpe.sumelectthermalfe: -1300.643249 hartree
dipole: 0.0001 0.4461 -0.1699
dipole: 0.4773
quadrupole: -72.4749 -85.1021 -71.1729
quadrupole: -0.0002 -0.0063 0.6333
quadrupole: 3.7751 -8.8522 5.0771 -0.0002 -0.0063 0.6333
hfenergy: -1300.7564375 hartree
pointgroup: C01 [X(C5H10Cl2N2O1)]
dipole: 0.0000231 0.1837049 0.0389719 debye
dipolederiv: -0.2834097 0.0924997 0.001569 0.1862263 -0.5120314 0.0720486 -0.0451831 0.1533473 -0.2636671 -0.2835827 -0.0927465 -0.0015887 -0.1864046 -0.5119594 0.0717243 0.045117 0.1530508 -0.2634713 -0.8319717 -0.0000722 0.000027 -0.0000471 -0.8509261 0.2840416 0.0001092 0.3207655 -0.5798888 -1.482733 0.2178505 -0.075953 0.3711501 -0.464978 -0.0799474 -0.1517943 -0.0773389 -0.5045491 -1.4833157 -0.2168356 0.0752656 -0.3697986 -0.4641165 -0.0801907 0.1516445 -0.0775278 -0.5048085 0.6478411 0.0473192 -0.0137559 0.3641512 -0.0403046 0.1249483 -0.2237181 0.1850132 0.1747217 0.6474407 -0.0478185 0.0143258 -0.3647542 -0.0400389 0.1246054 0.224049 0.1846412 0.175036 2.3953064 -0.0006037 0.0001567 -0.0006487 1.0473272 -0.4846054 0.0000068 -0.5361475 0.619354 0.1897882 -0.1443963 0.0603446 -0.2387249 0.6388248 -0.2399062 0.1119875 -0.2256075 0.2527479 0.1900413 0.1448466 -0.0604639 0.2391845 0.6387285 -0.2394673 -0.1121114 -0.2251509 0.2522313 0.1814187 0.0668826 -0.0136769 -0.0567872 0.0453211 0.0535188 0.0910475 0.0042861 0.0844947 -0.1310894 -0.0372888 -0.0613772 -0.0628187 0.1055645 -0.0405257 -0.0760372 -0.1009831 -0.0618358 -0.1310327 0.0375053 0.0613335 0.0628612 0.1056174 -0.0403997 0.0759386 -0.1008725 -0.0617821 0.181435 -0.067044 0.013694 0.0565973 0.0452119 0.0534846 -0.0910294 0.0043012 0.0845033 0.150904 -0.0236025 -0.0085594 -0.0920136 0.1795901 0.1281309 -0.0036619 0.1156186 0.2835782 0.1509439 0.0235751 0.0086493 0.0919195 0.1793605 0.1282071 0.0037121 0.1155531 0.2837501 -0.1210824 -0.0230558 0.0487154 -0.0151012 -0.0217603 0.0766062 0.0425479 0.0546695 0.0667058 0.0671441 -0.0065028 -0.1055895 0.0223641 -0.0287902 0.0055909 -0.0718585 -0.0011185 -0.0520024 0.0669578 0.0063638 0.1056877 -0.0224752 -0.0287788 0.0055345 0.0719424 -0.0011559 -0.0518271 -0.121004 0.0231239 -0.048804 0.0151197 -0.0218617 0.0766012 -0.0427088 0.054656 0.0667094 unknown
polarizability: 108.5679211|-0.0066709|92.3504839|0.0094386|-16.5118622|66.8628068 unknown
InChI: InChI=1S/C5H10Cl2N2O/c6-1-3-8-5(10)9-4-2-7/h8-9H,1-4H2
charge 0 multiplicity 1
20 atoms
Cl 3.677006 -1.823156 0.377948
Cl -3.675299 -1.820118 0.374019
O  0.002414 1.859393 -0.546852
N  1.177537 0.202219 0.618445
N  -1.174808 0.203523 0.618182
C  2.487519 0.728884 0.239512
C  -2.484114 0.731237 0.238376
C  0.001756 0.816639 0.184488
C  3.299104 -0.242742 -0.616163
C  -3.295552 -0.239298 -0.618714
H  2.295761 1.647381 -0.348194
H  3.071758 1.012054 1.136108
H  -3.068975 1.014105 1.134651
H  -2.291268 1.650012 -0.348532
H  1.155248 -0.654135 1.174772
H  -1.153569 -0.653056 1.174201
H  4.284366 0.164833 -0.887208
H  2.747004 -0.586084 -1.502587
H  -2.742874 -0.582378 -1.50488
H  -4.280312 0.169087 -0.890372
