program: Gaussian 09
title: 000009444
version: EM64L-G09RevD.01
frameworkgroup: C1[X(C8H12N4O5)]
method: RPBEPBE
basis: SDD
operation: Freq
keyword: #p
keyword: freq=noraman
keyword: PBEPBE/SDD
title: #p freq=noraman PBEPBE/SDD
converged: YES YES NO NO
title: Mulliken charges:
elementType: O O O O O N N N N C C C C C C C C H H H H H H H H H H H H
charge: -0.261786 -0.466752 -0.442258 -0.441921 -0.307189 -0.210304 -0.041648 -0.072039 -0.572727 -0.197452 -0.138009 -0.049290 -0.058979 -0.363085 0.179857 -0.126378 -0.028265 0.236621 0.223970 0.290306 0.286142 0.197690 0.217589 0.397094 0.376594 0.325259 0.353736 0.345199 0.348025
chargesum: 0.00000
title: Mulliken charges with hydrogens summed into heavy atoms:
elementType: O O O O O N N N N C C C C C C C C
charge: -0.261786 -0.069658 -0.065663 -0.088185 -0.307189 -0.210304 -0.041648 -0.072039 0.120497 0.039168 0.085961 0.236852 0.231328 0.052193 0.179857 0.198881 -0.028265
polarizability: 1.76355054e+02 1.43428947e+01 1.36953854e+02 5.52429111e+00 4.92068027e-01 7.96528677e+01
1716.lowfreq: -9.4205 -0.0009 -0.0009 -0.0003 9.4487 13.1071 35.6740 57.4049 65.9398
frequency: 35.6174 57.3772 65.9281 93.1197 121.3049 165.8626 174.8033 192.4934 201.0328 262.8642 272.3786 285.5845 305.5770 318.3117 359.4716 371.0093 389.4310 443.3482 484.4239 525.5805 539.4684 559.2099 562.9772 570.6181 587.4805 607.1885 672.7582 720.4659 725.9249 733.5121 759.2230 775.5354 805.7088 837.9635 875.3401 896.3740 961.4093 972.9253 981.5207 985.8023 1018.6487 1030.7509 1042.6062 1061.0895 1072.5726 1078.6341 1104.6459 1178.8325 1195.3253 1205.7138 1225.8741 1240.4689 1248.4230 1255.2161 1278.5553 1317.1762 1323.3696 1334.4511 1339.4110 1353.5186 1382.9427 1389.7094 1413.5741 1416.4869 1467.1202 1487.0934 1552.2869 1611.3576 1632.1855 2933.3264 2971.0604 2990.3453 2992.7977 3032.2415 3098.0895 3153.6615 3305.8882 3445.0697 3546.9504 3575.4164 3705.5797
redmass: 6.1281 6.7946 5.5335 5.9438 4.0981 6.1755 5.7050 5.2873 8.4621 5.6127 1.2184 3.5529 5.1354 8.3317 3.6513 7.3110 4.4634 3.1762 2.1716 1.3764 6.0120 1.3362 3.4658 10.1863 1.0948 6.9155 5.1769 3.9325 6.7338 1.2292 7.2544 10.3053 3.7353 5.9401 3.3748 4.0729 4.7448 2.0653 1.7222 2.4479 2.7817 3.8104 3.8587 3.8421 3.9580 2.6540 4.7358 1.1741 1.3046 3.9505 1.2567 1.2393 2.2230 1.2269 1.2454 1.3661 1.2917 1.2534 1.3585 1.3995 1.5572 1.5914 2.0013 2.5740 1.0781 3.2455 2.7153 3.3476 3.1842 1.0569 1.0852 1.0969 1.0921 1.0864 1.0886 1.0971 1.0650 1.0647 1.0446 1.0667 1.1060
irintensity: 0.2514 1.9817 7.0369 3.8278 3.2576 18.0851 4.8727 10.2879 3.0372 7.3848 146.1141 32.4115 1.4546 3.9459 9.5104 5.9532 6.3136 18.5945 91.9440 91.6181 17.7503 206.6648 37.0431 7.2152 51.9499 7.5963 35.3285 8.9669 4.9491 110.9458 11.5388 55.3149 18.0728 13.2526 6.0486 1.1767 64.1053 26.7344 26.6749 79.6553 73.8864 56.6304 38.8469 37.8436 106.3690 15.5586 80.5037 3.4925 24.2949 53.7031 7.3901 153.6576 39.8772 8.2784 6.0383 26.9930 14.4985 73.4309 8.1031 1.4862 125.1638 205.8418 73.8116 137.8046 6.0430 86.2579 66.5114 1149.2579 73.9418 45.4329 14.9634 84.4621 55.8263 11.2099 16.1764 12.8909 306.5588 44.5802 156.9126 7.5453 60.5409
temp: 298.150 k
press: 1.00000 atm
elementType: 8 8 8 8 8 7 7 7 7 6 6 6 6 6 6 6 6 1 1 1 1 1 1 1 1 1 1 1 1
symmnumber: 1
zpe: 575794.9 jmol-1
zpe.correction: 0.219309 hartree
zpe.thermalcorrener: 0.234832 hartree
zpe.thermalcorrenthalpy: 0.235776 hartree
zpe.thermalcorrgfe: 0.176402 hartree
zpe.sumelectzpe: -905.866566 hartree
zpe.sumelectthermal: -905.851043 hartree
zpe.sumelectthermalent: -905.850099 hartree
zpe.sumelectthermalfe: -905.909472 hartree
dipole: 2.2738 4.5832 3.2310
dipole: 6.0510
quadrupole: -86.4800 -103.9112 -98.4537
quadrupole: 1.9713 -6.2783 10.9346
quadrupole: 9.8016 -7.6295 -2.1721 1.9713 -6.2783 10.9346
hfenergy: -906.0858748 hartree
pointgroup: C01 [X(C8H12N4O5)]
dipole: 0.661099 -1.93365 -1.2212711 debye
polarizability: 172.5980227|-18.1592985|140.0950985|-8.7945388|-0.7143894|80.2686552 unknown
InChI: InChI=1S/C8H12N4O5/c9-7-10-2-12(8(16)11-7)6-5(15)4(14)3(1-13)17-6/h2-6,13-15H,1,9H2
charge 0 multiplicity 1
29 atoms
O  -1.416539 -0.585353 1.159013
O  -1.425218 2.57066 -0.55238
O  -3.582436 1.449307 0.503608
O  -1.910199 -3.083872 0.010971
O  1.265021 2.247008 -0.289169
N  0.737491 0.039307 0.290994
N  2.969863 0.626076 -0.395124
N  2.354272 -1.704256 0.145542
N  4.527319 -1.111198 -0.477231
C  -1.391132 1.125111 -0.572551
C  -2.835683 0.583169 -0.393416
C  -2.610969 -0.783673 0.281208
C  -0.634443 0.523551 0.656167
C  -2.372636 -1.909562 -0.736421
C  1.684538 1.053136 -0.152268
C  1.117674 -1.277794 0.409526
C  3.251349 -0.691961 -0.240035
H  -0.941524 0.742559 -1.511356
H  -3.355834 0.49195 -1.369215
H  -0.517226 1.285379 1.448934
H  -3.435249 -1.043423 0.9631
H  -1.618196 -1.604981 -1.49496
H  -3.333124 -2.110067 -1.257729
H  -0.46228 2.855696 -0.482209
H  -3.198055 2.3639 0.388162
H  0.343494 -1.982699 0.731646
H  -1.907051 -3.874943 -0.583973
H  4.755472 -2.095879 -0.3602
H  5.229902 -0.428847 -0.753934
