program: Gaussian 09
title: 000095785
version: EM64L-G09RevD.01
frameworkgroup: C1[X(C8H8N2O3)]
method: RPBEPBE
basis: SDD
operation: Freq
keyword: #pfreq=noraman
keyword: PBEPBE/SDD
title: #p freq=noraman PBEPBE/SDD
converged: YES YES NO NO
title: Mulliken charges:
elementType: O O O N N C C C C C C C C H H H H H H H H
charge: -0.228296 -0.246769 -0.190993 -0.228401 0.052392 -0.373329 -0.316637 0.287013 -0.333906 0.321673 -0.346717 -0.248938 -0.163904 0.255106 0.250727 0.239839 0.238987 0.229106 0.283882 0.257247 0.261918
chargesum: 0.00000
title: Mulliken charges with hydrogens summed into heavy atoms:
elementType: O O O N N C C C C C C C C
charge: -0.228296 -0.246769 -0.190993 -0.228401 0.052392 0.132505 0.162188 0.287013 -0.104799 0.321673 -0.062836 0.008308 0.098014
polarizability: 2.20158866e+02 -1.75668384e+00 1.09522857e+02 3.12877704e-01 7.99865541e-01 5.26014135e+01
1716.lowfreq: -8.6760 -1.0900 0.0003 0.0004 0.0009 11.2489 48.1250 66.3467 74.2785
frequency: 48.1142 66.3440 74.2500 98.5910 152.5252 179.2327 205.2590 262.0492 290.9227 367.0555 440.2603 535.2305 585.0904 628.4078 647.7773 664.2174 670.9900 726.8087 732.1966 809.1327 826.8597 858.6563 870.3303 890.4607 912.7877 924.5659 942.0166 977.5793 1006.7516 1013.6206 1053.6488 1096.9991 1131.5701 1158.9834 1169.7450 1176.9443 1192.6240 1215.7169 1241.5444 1334.7436 1348.7052 1362.2421 1385.1645 1471.6256 1483.0082 1493.1649 1560.9936 1601.3905 1736.8414 2976.2963 3031.7737 3042.6631 3044.9554 3115.0494 3224.2430 3244.1396 3269.5868
redmass: 4.2594 5.3720 5.6450 2.1387 5.8303 5.6512 5.1629 9.3287 2.9309 6.9782 7.7698 6.4909 3.1259 8.2489 4.4110 6.7888 9.8678 1.2749 6.3378 4.6129 1.2978 1.3857 6.5286 1.3665 1.4918 3.3331 4.0582 4.6961 1.8487 3.2726 2.8485 1.5571 1.6337 3.9152 3.3503 1.2904 2.3781 1.2932 1.5353 1.4318 1.4276 2.6013 2.2563 4.9976 1.0858 1.0868 6.0092 7.6485 12.6681 1.0597 1.0833 1.0809 1.0872 1.1086 1.0916 1.0997 1.1079
irintensity: 5.8642 0.0334 7.5331 1.0930 4.1104 2.5395 0.5379 0.9004 9.8817 2.0907 3.4084 12.2390 7.6063 26.4734 0.7262 3.6838 14.7056 87.5561 8.4309 17.6740 28.3387 8.1610 7.7422 0.0280 30.9415 2.4910 24.7614 274.9553 59.0217 21.2921 14.8198 11.3147 22.2850 0.5017 353.1423 3.9931 49.8227 36.4439 29.3233 14.3376 15.1402 68.8949 49.5806 56.7965 15.9528 6.1048 19.1889 0.5370 544.2790 24.4711 24.4009 31.3456 46.4694 21.7552 5.1670 0.6178 0.0027
temp: 298.150 k
press: 1.00000 atm
elementType: 8 8 8 7 7 6 6 6 6 6 6 6 6 1 1 1 1 1 1 1 1
symmnumber: 1
zpe: 404173.0 jmol-1
zpe.correction: 0.153941 hartree
zpe.thermalcorrener: 0.165167 hartree
zpe.thermalcorrenthalpy: 0.166111 hartree
zpe.thermalcorrgfe: 0.115290 hartree
zpe.sumelectzpe: -643.812067 hartree
zpe.sumelectthermal: -643.800841 hartree
zpe.sumelectthermalent: -643.799896 hartree
zpe.sumelectthermalfe: -643.850718 hartree
dipole: -1.9614 -5.8567 0.1962
dipole: 6.1795
quadrupole: -67.1460 -75.8130 -75.6817
quadrupole: -19.2872 0.9319 0.3030
quadrupole: 5.7343 -2.9328 -2.8014 -19.2872 0.9319 0.3030
hfenergy: -643.9660079 hartree
pointgroup: C01 [X(C8H8N2O3)]
dipole: 0.8096102 -2.2921791 0.0344362 debye
dipolederiv: -1.2351515 -0.4090015 -0.0301552 -0.4459142 -0.8189308 -0.0260482 0.0287292 0.0204649 -0.2946012 0.0004432 -0.147866 0.0142258 -0.0537848 -0.6174323 0.0404783 0.0090574 0.0372454 -0.1359751 -0.5551036 -0.0211566 -0.0102911 0.5492681 -1.2163572 0.0268286 -0.02119 0.0175189 -0.3239172 -2.0689892 0.314772 -0.0568907 0.3474922 -0.5274408 0.0225719 -0.0593742 -0.0113608 -0.1923672 1.004975 -0.120293 0.040192 0.4535952 -0.2494288 0.0188071 -0.0100925 0.0127119 -0.0880207 -0.157945 0.0274484 -0.0181987 0.0103047 0.2714581 -0.0350817 -0.0046846 -0.0255217 0.3463708 0.2952715 0.0013688 0.0041519 0.2766394 0.5447586 0.0547092 0.0338265 0.0320148 0.3554314 2.3817313 0.0966335 0.0488482 -1.1348344 1.9225125 -0.0507972 0.0265809 -0.0451585 0.2967868 0.4188345 0.0769894 0.0087041 0.5031319 0.2770363 -0.0235885 -0.0272462 -0.0276972 -0.0918809 -0.1167439 -0.018893 0.0000621 -0.3667209 0.2503646 -0.0283054 0.029575 -0.0216195 0.0019562 0.2022943 -0.0671335 0.0141671 -0.035725 -0.0902855 -0.0081006 0.0127656 -0.0077574 -0.1705236 -0.1614435 0.0724357 -0.0041697 0.3081951 -0.0858899 -0.0027663 -0.0249339 -0.0073599 -0.1964085 -0.3260358 0.1272653 -0.0123256 -0.1482524 0.3230661 -0.0420233 0.0083905 -0.0367623 -0.1373109 0.0408429 0.0394463 -0.0651401 -0.0537199 -0.0108117 0.0406315 -0.018665 0.1012737 -0.0925118 0.0394964 0.0962008 0.0642381 -0.0034486 -0.0323015 -0.0461728 0.0429834 -0.0830192 -0.0124882 0.0525157 0.0040778 -0.0375246 -0.0615646 -0.0169689 -0.0461624 -0.1114355 -0.0990313 -0.0881103 0.0040577 -0.0485442 0.0533796 -0.0910756 -0.0151867 0.04295 0.0988632 0.0855226 0.0043318 0.0348636 -0.0426798 0.0000152 -0.0749368 -0.1048581 0.0253531 0.0015031 0.0221649 0.1989888 0.0934822 0.0620768 -0.0076936 0.0644202 0.0621083 0.0129493 -0.0079659 0.0126322 0.1973362 0.0039929 -0.0752541 0.0017465 -0.0890838 0.0706079 0.0086782 0.0024309 0.0089775 0.1986617 0.0486114 0.0321068 -0.0073412 0.0460142 0.06398 0.0150891 -0.0091178 0.0147611 0.2242516 unknown
polarizability: 220.0083477|3.6728428|109.4432824|3.1953062|-3.1357448|52.8315066 unknown
InChI: InChI=1S/C8H8N2O3/c11-8-10(3-5-13-8)9-6-7-2-1-4-12-7/h1-2,4,6H,3,5H2
charge 0 multiplicity 1
21 atoms
O  -3.857632 0.105995 -0.066702
O  3.035621 -1.138929 0.090632
O  -2.574308 2.066329 -0.144956
N  -1.586871 -0.117813 -0.115359
N  -0.286644 0.331645 -0.114825
C  -2.051763 -1.514875 0.027464
C  -3.581027 -1.352894 -0.18336
C  -2.639158 0.833706 -0.117794
C  0.686608 -0.55825 -0.016333
C  2.061287 -0.112929 -0.020907
C  2.703107 1.122155 -0.109872
C  4.121233 0.868845 -0.052885
C  4.28708 -0.504048 0.068705
H  -1.793498 -1.910336 1.029621
H  -1.596069 -2.168471 -0.738779
H  -3.898622 -1.675096 -1.1891
H  -4.179538 -1.864619 0.584813
H  0.539603 -1.648302 0.072801
H  2.200849 2.082164 -0.203471
H  4.917622 1.609113 -0.095813
H  5.14962 -1.159691 0.147019
