program: Gaussian 09
title: 000095752
version: EM64L-G09RevD.01
frameworkgroup: C1[X(C13H8ClNS)]
method: RPBEPBE
basis: SDD
operation: Freq
keyword: #p
keyword: freq=noraman
keyword: PBEPBE/SDD
title: #p freq=noraman PBEPBE/SDD
converged: NO YES NO NO
title: Mulliken charges:
elementType: Cl S N C C C C C C C C C C C C C H H H H H H H H
charge: -0.045913 0.228372 -0.031809 -0.337709 0.325098 -0.361958 0.535286 -0.275990 -0.345881 -0.373931 -0.351149 -0.236345 -0.212202 -0.203941 -0.213968 -0.111065 0.247440 0.260042 0.281670 0.240578 0.232211 0.233464 0.259379 0.258320
chargesum: 0.00000
title: Mulliken charges with hydrogens summed into heavy atoms:
elementType: Cl S N C C C C C C C C C C C C C
charge: -0.045913 0.228372 -0.031809 -0.337709 0.325098 -0.361958 0.535286 -0.028550 -0.085839 -0.092261 -0.110571 -0.004134 0.021263 0.055438 0.044352 -0.111065
polarizability: 3.59857287e+02 6.88389978e+00 1.63710590e+02 1.47455337e-02 -4.73748645e-02 6.19092452e+01
1716.lowfreq: -6.4418 -1.7495 -0.0029 -0.0015 0.0012 3.8377 37.3143 44.1398 78.8845
frequency: 37.2227 44.1147 78.8831 112.0377 187.5708 216.6106 234.4921 236.8261 327.4120 335.9901 395.0867 404.2867 434.4975 437.3992 480.1349 487.8654 550.1092 577.6577 612.1720 612.5450 648.3093 681.7059 697.7981 717.8841 733.8040 768.0085 823.1220 842.3443 845.1029 865.0490 903.5395 948.9465 954.3422 983.8961 986.8011 998.9510 1015.5243 1042.6227 1073.2493 1112.3568 1118.3597 1170.0158 1186.2673 1196.4499 1254.1778 1291.4813 1297.9755 1365.5632 1376.1084 1401.6089 1431.0580 1445.0654 1466.0874 1527.5396 1564.8038 1574.6769 1595.8562 1609.7000 3137.8980 3138.2399 3151.9252 3160.4051 3166.0804 3175.2454 3176.5733 3179.5813
redmass: 4.4283 7.9604 7.9616 7.3233 5.8324 12.2779 8.3660 6.5150 5.2203 6.0288 8.8977 2.8871 3.1199 9.6476 3.7071 9.1099 3.6261 8.0989 5.7382 7.5306 8.5105 7.3503 7.4698 3.5083 2.5575 1.5752 1.3302 6.4948 1.4665 1.3937 7.7986 1.3829 1.3779 1.3589 1.3213 3.9982 2.2386 5.0609 2.7906 1.4036 1.5172 1.1724 1.1608 2.7371 1.8515 2.0563 1.4299 5.1296 4.6568 3.9374 2.9637 2.5867 2.5950 8.5254 6.1849 7.6412 6.2903 7.1519 1.0858 1.0898 1.0904 1.0886 1.0957 1.0955 1.0998 1.0975
irintensity: 0.0000 0.2071 0.2036 2.0772 1.4518 1.2297 3.1615 0.3429 2.9019 1.3129 2.7187 0.0076 3.2024 26.2821 21.5337 0.8720 6.6024 6.6207 2.8753 8.9337 20.6912 1.0935 11.7719 2.1244 24.2950 77.8576 16.1579 0.2044 54.8561 1.8059 83.0558 2.9178 0.0694 1.1081 0.0459 31.9421 10.2948 5.7441 67.2326 15.3866 2.7405 0.0563 8.3868 16.2301 9.6401 15.0476 0.0648 2.3670 12.2346 16.1188 17.7276 2.2546 120.4709 16.6155 4.4026 10.8892 25.0201 23.3410 2.2044 6.6241 8.4776 0.5068 15.9054 3.1537 22.8390 2.7189
temp: 298.150 k
press: 1.00000 atm
elementType: 17 16 7 6 6 6 6 6 6 6 6 6 6 6 6 6 1 1 1 1 1 1 1 1
symmnumber: 1
zpe: 446237.1 jmol-1
zpe.correction: 0.169963 hartree
zpe.thermalcorrener: 0.182676 hartree
zpe.thermalcorrenthalpy: 0.183620 hartree
zpe.thermalcorrgfe: 0.129244 hartree
zpe.sumelectzpe: -1411.985866 hartree
zpe.sumelectthermal: -1411.973153 hartree
zpe.sumelectthermalent: -1411.972208 hartree
zpe.sumelectthermalfe: -1412.026585 hartree
dipole: 2.2100 -0.5804 -0.0015
dipole: 2.2849
quadrupole: -98.4483 -96.0111 -112.4096
quadrupole: 0.5757 -0.0055 -0.0623
quadrupole: 3.8414 6.2785 -10.1199 0.5757 -0.0055 -0.0623
hfenergy: -1412.1558287 hartree
pointgroup: C01 [X(C13H8Cl1N1S1)]
dipole: 0.8622741 0.2540817 -0.0073401 debye
dipolederiv: -1.138457 -0.0581646 -0.0000248 -0.0700197 -0.1216758 0.0025759 0.000494 0.0025516 -0.0626296 -0.3611441 -0.0647028 0.0013254 -0.2133642 -0.4378911 0.0166985 0.0059859 0.0179826 0.0622687 -0.5115378 0.2254455 -0.0083076 0.1443329 -0.6924973 0.017649 -0.004206 0.0182819 -0.1808417 0.2306392 -0.2240545 0.0082848 -0.2229325 -0.0212337 -0.0024962 0.0088387 -0.0026273 -0.0756957 0.1572598 -0.1258278 0.0048158 0.0516366 0.0068318 0.0024297 -0.0036759 0.0022365 0.0731319 0.8792423 0.1708772 -0.0044007 0.4755307 0.9292685 -0.0310571 -0.013796 -0.0337038 -0.0326346 -0.0951501 -0.0132245 0.000573 -0.1654973 -0.133558 0.0060139 0.0051185 0.006921 0.0323929 -0.0620838 0.1183201 -0.0039968 0.1840262 0.0756124 -0.0066084 -0.0054926 -0.0066449 -0.1242382 0.139059 0.0605679 -0.0015947 -0.0553053 0.0885907 -0.0082682 0.0023842 -0.0080846 -0.1484611 0.0164055 -0.0669683 0.0035116 0.1505126 0.0463206 -0.0071899 -0.0053626 -0.007231 -0.1144254 0.1217382 0.0543735 -0.0023896 -0.0632859 0.0222896 -0.0080803 0.0015654 -0.0073895 -0.1356816 -0.0708794 0.0364006 -0.0010491 0.1257164 0.0727638 -0.0078023 -0.0041922 -0.0079914 -0.1609984 -0.1048759 -0.1307734 0.0046536 -0.2865811 -0.0178444 -0.0056424 0.0102279 -0.0053341 -0.163927 -0.4373822 0.0913046 -0.0051806 0.1683886 0.0234274 -0.0053141 -0.0090565 -0.0054097 -0.1010244 -0.4469803 -0.1264792 0.0051465 -0.3115503 -0.0170162 -0.0044957 0.0143712 -0.0042276 -0.0996596 1.4864366 0.0793937 0.0002565 0.1351217 0.1643235 -0.0103515 -0.0024614 -0.010581 -0.0678393 0.0790714 0.0031465 -0.0003143 -0.0641171 -0.0551538 0.0075934 0.0021031 0.0077792 0.1669671 0.0884665 -0.0506117 0.00162 -0.0003305 -0.0432135 0.0073088 -0.0002238 0.0072884 0.1691519 0.0895314 0.079194 -0.003879 0.0522439 0.0376167 0.0057374 -0.0030266 0.0053054 0.15431 0.0588724 -0.0976706 0.0041182 -0.096825 -0.0058201 0.0073711 0.0044945 0.0069033 0.1526394 -0.1203526 -0.0614875 0.0015094 -0.0589042 0.0679846 0.0032001 0.0012232 0.0031814 0.1645519 -0.0641419 0.1019605 -0.0039921 0.1167245 0.0067053 0.0056542 -0.0044548 0.0056331 0.1634013 0.0384077 -0.0630508 0.0025748 -0.0685837 -0.0057458 0.0076513 0.0027876 0.0077007 0.1639335 0.027855 0.0620315 -0.0032602 0.0730629 0.009915 0.0074227 -0.0036457 0.0074597 0.1653079 unknown
polarizability: 360.0918837|-0.9989572|163.3199336|0.6769694|-3.961073|62.0653053 unknown
InChI: InChI=1S/C13H8ClNS/c14-10-7-5-9(6-8-10)13-15-11-3-1-2-4-12(11)16-13/h1-8H
charge 0 multiplicity 1
24 atoms
Cl -6.046238 -0.239189 -0.011742
S  0.933607 1.786767 -0.068762
N  0.849647 -0.910552 0.025018
C  2.478087 0.84955 -0.032392
C  2.208437 -0.560189 0.015989
C  0.0451 0.135444 -0.013026
C  -1.420133 0.077443 -0.014179
C  3.795855 1.345648 -0.046739
C  3.285388 -1.479157 0.0500
C  -2.057443 -1.195316 0.042239
C  -2.22454 1.247487 -0.070201
C  4.857274 0.413127 -0.012119
C  4.603466 -0.98514 0.035656
C  -3.461159 -1.297483 0.04326
C  -3.631088 1.157616 -0.069783
C  -4.23005 -0.116392 -0.012816
H  4.000923 2.419628 -0.083678
H  3.071275 -2.551162 0.086486
H  -1.433287 -2.09261 0.084981
H  -1.75819 2.238162 -0.11563
H  5.890218 0.777037 -0.022446
H  5.445111 -1.685141 0.061506
H  -3.950302 -2.27464 0.086893
H  -4.248858 2.058663 -0.113214
