program: Gaussian 09
title: 000095724
version: EM64L-G09RevD.01
frameworkgroup: C1[X(C14H10O)]
method: RPBEPBE
basis: SDD
operation: Freq
keyword: #pfreq=noraman
keyword: PBEPBE/SDD
title: #p freq=noraman PBEPBE/SDD
converged: NO YES NO YES
title: Mulliken charges:
elementType: O C C C C C C C C C C C C C C H H H H H H H H H H
charge: -0.433375 0.242060 0.196449 0.442818 0.423032 -0.482336 -0.480690 -0.514231 -0.361131 -0.418032 -0.433678 0.284003 -0.415062 -0.260595 -0.246578 0.236612 0.234338 0.248266 0.226154 0.239263 0.238833 0.221808 0.227714 0.228417 0.355942
chargesum: 0.00000
title: Mulliken charges with hydrogens summed into heavy atoms:
elementType: O C C C C C C C C C C C C C C
charge: -0.077434 0.242060 0.196449 0.442818 0.423032 -0.245724 -0.246352 -0.265965 -0.134977 -0.178769 -0.194845 0.284003 -0.193254 -0.032881 -0.018161
polarizability: 2.59991009e+02 -7.63349600e+00 1.71473112e+02 -3.24360791e-04 1.48683652e-03 5.87281736e+01
1716.lowfreq: -10.9193 -0.0009 0.0004 0.0011 5.5662 12.9169 81.9370 104.0350 179.9314
frequency: 81.9269 104.0206 179.9312 193.5476 244.1179 304.3474 341.9806 353.6812 390.4053 422.0994 431.7919 450.0443 474.3393 513.7659 523.9965 566.0757 616.4987 622.9069 685.3369 707.9231 721.7988 755.9677 763.0820 788.8016 806.0209 844.2489 867.7959 883.0764 889.0717 889.8014 939.9226 958.2058 980.7064 991.5936 1013.9183 1038.3119 1093.6776 1144.5446 1154.6319 1164.3441 1177.5272 1212.0004 1230.0463 1239.3231 1252.3000 1278.9466 1310.3931 1394.1095 1403.5938 1411.4098 1444.0633 1448.4258 1453.5248 1513.5683 1528.9216 1578.9315 1611.7389 1626.5655 1639.9406 3113.9521 3116.2337 3120.0279 3132.4737 3140.0784 3142.6859 3148.4515 3163.7742 3175.6394 3583.7565
redmass: 4.6005 4.2402 4.3157 5.6189 4.1322 4.5204 1.1031 5.3928 6.6830 3.0641 3.0793 5.8771 4.1472 2.9197 6.6193 3.1144 3.3409 7.1063 5.9708 5.9610 2.6977 1.3201 6.1606 1.4920 1.8631 1.6555 4.1459 1.5108 2.1059 6.2512 1.3498 1.3897 1.3857 1.3627 3.5105 2.1243 2.2211 1.3895 1.2626 1.2534 1.0946 1.8708 1.8523 2.7081 1.5287 1.6591 2.2894 5.4712 3.5448 2.1796 3.8038 2.9117 2.8048 3.5303 4.1504 7.7096 5.9332 6.6763 6.5054 1.0873 1.0862 1.0864 1.0883 1.0978 1.0974 1.0940 1.1000 1.0903 1.0661
irintensity: 0.0160 4.1494 2.4303 2.4088 0.0283 3.3488 141.4642 5.5441 0.1551 1.4035 5.6252 1.5909 9.9574 7.8979 0.1668 8.1506 14.8634 8.7597 5.5074 0.3556 1.7785 62.5486 11.0103 0.0051 0.0736 105.9871 2.5280 3.9666 18.5048 36.5699 2.8109 6.8500 0.0084 0.0945 12.3568 6.4298 7.3685 182.2371 62.8130 35.8477 2.7850 3.4850 1.4406 15.8843 7.9113 23.1350 25.5484 6.9605 6.4863 1.6365 4.7797 8.6072 28.8055 45.0028 29.2663 10.1850 20.3178 2.3315 84.9925 11.8420 1.7934 3.2058 5.0135 15.7045 41.2441 29.3992 30.1859 8.1711 56.8597
temp: 298.150 k
press: 1.00000 atm
elementType: 8 6 6 6 6 6 6 6 6 6 6 6 6 6 6 1 1 1 1 1 1 1 1 1 1
symmnumber: 1
zpe: 511347.7 jmol-1
zpe.correction: 0.194762 hartree
zpe.thermalcorrener: 0.205638 hartree
zpe.thermalcorrenthalpy: 0.206582 hartree
zpe.thermalcorrgfe: 0.158379 hartree
zpe.sumelectzpe: -613.724391 hartree
zpe.sumelectthermal: -613.713515 hartree
zpe.sumelectthermalent: -613.712571 hartree
zpe.sumelectthermalfe: -613.760774 hartree
dipole: -1.2739 1.1579 0.0000
dipole: 1.7215
quadrupole: -63.3912 -79.4829 -94.0550
quadrupole: -3.5196 -0.0001 0.0002
quadrupole: 15.5852 -0.5066 -15.0786 -3.5196 -0.0001 0.0002
hfenergy: -613.9191526 hartree
pointgroup: C01 [X(C14H10O1)]
dipole: 0.5120692 0.4432826 -0.0000049 debye
dipolederiv: -0.990957 0.6407705 -0.0000067 1.0314886 -0.7783438 0.0000043 -0.0000078 0.0000019 -0.4229181 0.3269159 -0.1430482 0.0000012 -0.1187655 0.1206003 -0.0000013 -0.0000004 -0.0000024 -0.0000529 0.0578934 0.1379868 -0.0000019 0.0291837 -0.0333298 -0.0000003 0.000001 -0.0000004 -0.0037857 -0.170499 -0.1272013 0.0000017 -0.0255022 -0.2072303 0.000003 0. 0.0000036 0.0330645 0.0199192 0.1400169 -0.0000018 0.2286862 0.0441672 -0.0000008 -0.0000023 -0.0000003 0.0580314 0.1446238 0.0222869 -0.0000002 -0.1941651 0.1345635 -0.0000026 0.0000027 -0.0000028 -0.172981 -0.1682257 -0.0950048 0.0000008 -0.0067436 0.0623634 -0.0000027 -0.0000008 -0.0000024 -0.1925757 -0.5073756 0.3044006 -0.0000021 0.0348684 -0.0442409 -0.0000014 0.0000003 -0.000001 -0.168235 -0.0670502 -0.104581 0.0000005 -0.0180849 0.0190756 -0.0000017 0.0000004 0. -0.1413457 0.2692845 0.0855608 -0.0000006 -0.0269748 0.1352241 -0.0000041 0.0000025 -0.0000037 -0.1475405 0.0154007 -0.1233892 0. -0.1827963 0.0261131 -0.0000008 -0.0000013 -0.0000015 -0.178162 0.9637437 -0.6584841 0.0000066 -0.9446387 0.7103338 -0.0000066 0.0000055 -0.0000047 0.0665464 -0.1001551 0.0035839 -0.0000011 0.432213 -0.2346325 -0.0000004 -0.0000082 -0.0000005 -0.2021452 -0.1062218 0.0680761 -0.0000014 0.0064108 0.0920996 -0.0000042 -0.0000009 -0.0000043 -0.1683762 0.100073 -0.005686 0.0000007 -0.0154714 -0.0266079 -0.0000017 0.0000022 -0.0000014 -0.160697 0.0428979 -0.1087986 0.0000011 -0.0324988 -0.0940693 0.0000027 0.0000004 0.0000024 0.1538037 -0.0197179 0.1325342 -0.0000011 0.0581069 -0.0334359 0.0000023 0.0000002 0.0000016 0.1565953 0.1019698 -0.0684071 0.0000003 -0.0201831 -0.0389282 0.0000021 -0.0000005 0.0000022 0.1594107 0.0317982 0.1229104 -0.0000008 0.067186 -0.0243704 0.000002 0.0000003 0.0000015 0.1432035 0.0647107 -0.0217768 0.0000005 -0.0869449 -0.0958389 0.0000033 0.0000005 0.0000034 0.1521742 0.006779 0.0612735 -0.0000001 0.1353367 -0.0522589 0.0000014 -0.0000011 0.0000016 0.1553545 -0.1610362 -0.0135687 0.0000011 0.0151538 0.0827042 0.0000012 0.0000022 0.0000016 0.1741198 0.0426296 -0.0696865 0.0000011 -0.0989848 -0.1042852 0.0000041 0.0000004 0.0000034 0.1605673 -0.1514892 -0.0393496 0.0000005 -0.0395451 0.0870194 0.0000009 0.0000016 0.0000013 0.1616852 0.2540885 -0.1404186 0.0000017 -0.2273348 0.2533079 0.0000013 0.0000029 0.0000013 0.3842584 unknown
polarizability: 260.3084228|5.4838565|171.1556977|-0.0003602|-0.0014786|58.7281736 unknown
InChI: InChI=1S/C14H10O/c15-12-8-7-11-6-5-10-3-1-2-4-13(10)14(11)9-12/h1-9,15H
charge 0 multiplicity 1
25 atoms
O  3.724237 -1.996761 -0.000001
C  0.521782 -0.114068 -0.000026
C  -0.925204 -0.360458 -0.000019
C  0.998904 1.250012 -0.00004
C  -1.830283 0.764819 -0.000027
C  0.055973 2.344714 -0.000051
C  -1.305326 2.112954 -0.000047
C  1.478585 -1.169113 -0.00001
C  -1.485914 -1.674188 0.000005
C  2.404992 1.498161 -0.000042
C  -3.241235 0.53534 -0.000018
C  2.852648 -0.892703 -0.00001
C  3.330984 0.450902 -0.000028
C  -2.873061 -1.877041 0.000013
C  -3.761855 -0.763902 -0.000004
H  0.44716 3.36924 -0.000061
H  -2.014849 2.948804 -0.000055
H  1.175526 -2.218922 0.000001
H  -0.82761 -2.548581 0.000013
H  2.75693 2.536367 -0.000056
H  -3.914098 1.401523 -0.000023
H  4.409252 0.656605 -0.000035
H  -3.274816 -2.896278 0.000029
H  -4.845173 -0.926762 -0.000003
H  4.66865 -1.702465 -0.000005
