program: Gaussian 09
title: 000095693
version: EM64L-G09RevD.01
frameworkgroup: C1[X(C9H10O3)]
method: RPBEPBE
basis: SDD
operation: Freq
keyword: #pfreq=noraman
keyword: PBEPBE/SDD
title: #p freq=noraman PBEPBE/SDD
converged: YES YES NO NO
title: Mulliken charges:
elementType: O O O C C C C C C C C C H H H H H H H H H H
charge: -0.315037 -0.426353 -0.228758 0.343431 0.215201 -0.464546 0.160397 -0.369126 -0.325340 0.119251 -0.789100 -0.523238 0.300627 0.240667 0.241171 0.235611 0.235345 0.260727 0.230369 0.230292 0.247921 0.380488
chargesum: 0.00000
title: Mulliken charges with hydrogens summed into heavy atoms:
elementType: O O O C C C C C C C C C
charge: -0.315037 -0.045865 -0.228758 0.343431 0.215201 -0.163919 0.160397 -0.128460 -0.084169 0.119251 -0.057416 0.185344
polarizability: 1.70229181e+02 -3.45356919e+00 1.13735576e+02 -3.17980747e-02 1.92062514e-02 5.34635204e+01
1716.lowfreq: -0.0008 -0.0007 -0.0005 4.0604 4.8336 15.4367 62.3024 75.9887 126.4681
frequency: 62.2669 75.9543 126.4622 141.6883 157.6009 198.1348 213.2089 228.5461 302.3269 325.5358 330.6829 439.5695 445.2728 491.7791 520.8992 529.1999 532.5926 586.1484 644.1561 659.5449 729.2962 736.0373 793.2327 880.6609 917.6780 923.9542 966.1949 990.5793 1025.4736 1061.0119 1117.2451 1130.2237 1150.7178 1178.1880 1198.7657 1255.1453 1267.5273 1293.7122 1369.6982 1399.8802 1438.0186 1448.7439 1463.0160 1464.5723 1467.3905 1475.2626 1496.2719 1573.0726 1598.9255 1626.1112 2973.0451 2985.6532 3065.9217 3070.7473 3124.6734 3133.7095 3147.8590 3168.2313 3173.4574 3517.3239
redmass: 4.9114 3.4001 4.6843 1.0362 4.0369 2.2946 4.3364 1.4987 5.6591 4.7842 3.6785 5.2629 3.2408 1.1157 4.7902 3.3618 5.2542 4.5034 3.0842 5.0661 3.8010 5.6084 1.3877 5.2397 1.3846 1.3712 1.9601 7.5320 1.8241 1.9296 1.2544 2.1356 1.3473 1.7308 1.7067 2.4297 2.3750 1.9169 1.2587 6.7255 1.2257 1.0954 2.5469 1.0556 1.0494 1.1850 2.9007 7.4511 7.8644 6.7497 1.0322 1.0374 1.1047 1.0971 1.0991 1.1006 1.0872 1.0954 1.0928 1.0646
irintensity: 1.0155 3.5294 4.1016 0.4806 0.3301 0.1628 4.6005 0.1969 3.7024 0.2280 9.2141 1.4960 7.0227 146.6146 5.4972 3.4703 33.1817 11.1792 4.4139 0.2926 3.3804 28.2225 50.4338 40.1295 14.3334 11.7968 17.1967 49.0364 1.2795 17.2884 0.1356 106.1410 10.1671 89.4934 41.1769 42.5601 407.4377 116.5642 49.3116 65.7576 27.9283 29.6850 76.6954 20.4225 16.4091 23.1128 98.4816 145.2659 91.0333 19.1047 60.5978 4.2904 39.4981 14.3249 18.2778 19.4404 6.4565 9.2179 6.9528 75.0528
temp: 298.150 k
press: 1.00000 atm
elementType: 8 8 8 6 6 6 6 6 6 6 6 6 1 1 1 1 1 1 1 1 1 1
symmnumber: 1
zpe: 447456.0 jmol-1
zpe.correction: 0.170427 hartree
zpe.thermalcorrener: 0.182240 hartree
zpe.thermalcorrenthalpy: 0.183184 hartree
zpe.thermalcorrgfe: 0.132694 hartree
zpe.sumelectzpe: -573.726033 hartree
zpe.sumelectthermal: -573.714220 hartree
zpe.sumelectthermalent: -573.713276 hartree
zpe.sumelectthermalfe: -573.763766 hartree
dipole: 4.7007 -5.4690 0.0105
dipole: 7.2116
quadrupole: -62.5338 -70.1224 -72.3750
quadrupole: 3.8635 0.1016 0.0103
quadrupole: 5.8100 -1.7787 -4.0313 3.8635 0.1016 0.0103
hfenergy: -573.8964603 hartree
pointgroup: C01 [X(C9H10O3)]
dipole: -1.8506744 -2.0763999 -0.5599441 debye
dipolederiv: -1.8471422 -0.3393955 -0.1834904 -0.2070603 -0.422451 -0.0412489 -0.1570033 -0.0514954 -0.3185222 -0.6001431 0.5820835 0.1064434 0.657948 -0.9383813 -0.0576261 0.122493 -0.0651603 -0.4139001 -0.9910818 -0.1372492 -0.0757095 -0.4225351 -0.7393079 -0.112732 -0.132903 -0.0927182 -0.3494206 -0.9812402 -0.0945459 -0.0887989 0.1361492 -0.0011211 0.0157468 -0.0429769 -0.001475 -0.0284412 1.5096363 0.1155097 0.1308296 0.0628582 -0.1205487 -0.0320974 0.1211337 -0.028014 0.0606436 0.0530753 0.3331529 0.0805008 -0.1935726 -0.0723027 -0.0031545 -0.0250049 0.0356811 -0.1217693 0.1544473 -0.680339 -0.1323208 -0.9350052 0.7960864 0.0812618 -0.1841132 0.1003578 0.0646947 0.1774294 0.0185314 0.0290696 0.1053018 -0.044852 0.0329106 0.0458744 0.0268198 -0.1605719 -0.3155313 -0.0037535 -0.01166 0.267547 0.0042933 0.0549738 0.0432819 0.0346686 -0.1606431 1.9163331 -0.0190655 0.1267424 0.0429544 0.8929764 0.1554719 0.1387873 0.1523097 0.1582472 -0.2224634 0.1948136 0.0182168 0.3413299 -0.3442627 -0.0554549 0.049187 -0.0671883 0.0472241 0.6514691 0.1971009 0.0643498 0.5505136 0.4597818 0.0687163 0.1370644 0.0428772 0.34154 0.1328063 -0.0569083 -0.0140462 0.0018221 0.0535106 -0.0229557 -0.0021314 -0.027162 0.1622179 0.0520333 0.0839869 0.0098211 0.0939307 -0.029451 -0.0295313 0.0118799 -0.0303346 0.1452306 0.0266926 -0.0853061 -0.0272834 -0.0961982 -0.0257133 -0.0456008 -0.0296688 -0.0446479 0.1540179 0.0864714 -0.0108859 -0.0747327 0.0010179 0.0700044 -0.0555878 -0.0369958 -0.0717503 -0.0667596 0.0665417 -0.0572836 0.0784182 -0.0294832 0.0049277 0.0800737 0.0481254 0.0933595 0.0179461 -0.1137924 0.0047236 -0.0182049 -0.0654063 0.0940144 -0.0105567 -0.0327556 -0.0045339 0.1171668 0.0651673 0.0375045 -0.0563973 -0.1392882 -0.0782327 0.080983 -0.0195744 0.1079778 -0.043387 0.054013 0.0242359 0.0904828 -0.126285 -0.0015575 -0.0856648 -0.0134998 -0.0881737 -0.1082641 -0.1371195 0.0169554 -0.0169464 0.068254 0.073064 -0.0056626 -0.0066675 -0.0096448 0.1253921 0.2623978 -0.1238656 -0.0352837 -0.1147927 0.3695228 -0.0122644 -0.0345324 -0.011753 0.377358 unknown
polarizability: 169.6516905|1.5625745|111.2887764|8.8165347|11.786729|56.4878105 unknown
InChI: InChI=1S/C9H10O3/c1-6(10)7-3-4-9(12-2)8(11)5-7/h3-5,11H,1-2H3
charge 0 multiplicity 1
22 atoms
O  -2.957549 0.140274 -0.259173
O  -1.606145 2.378064 0.296107
O  3.335564 1.160553 0.401333
C  1.255079 0.005621 0.022524
C  -1.562662 -0.017696 -0.187663
C  0.517207 1.208482 0.212003
C  -0.877919 1.201601 0.109512
C  0.564603 -1.199162 -0.271138
C  -0.844187 -1.21463 -0.377571
C  2.749297 0.067113 0.142423
C  3.559439 -1.213817 -0.050449
C  -3.769664 -1.041939 -0.562893
H  1.051731 2.135817 0.437247
H  1.116378 -2.132069 -0.419766
H  -1.364487 -2.150015 -0.604505
H  3.406266 -1.632999 -1.062452
H  3.262189 -1.988836 0.680222
H  4.626761 -0.982113 0.08419
H  -3.64323 -1.816764 0.216482
H  -3.504717 -1.456492 -1.553791
H  -4.809976 -0.686517 -0.571744
H  -2.572778 2.178422 0.177401
