program: Gaussian 09
title: 000095672
version: EM64L-G09RevD.01
frameworkgroup: C1[X(C10H11NO)]
method: RPBEPBE
basis: SDD
operation: Freq
keyword: #p
keyword: freq=noraman
keyword: PBEPBE/SDD
title: #p freq=noraman PBEPBE/SDD
converged: YES YES NO NO
title: Mulliken charges:
elementType: O N C C C C C C C C C C H H H H H H H H H H H
charge: -0.245770 -0.402610 -0.209459 -0.462974 -0.512260 0.498939 0.147772 -0.390315 -0.445736 -0.222593 -0.220464 -0.241525 0.238128 0.245841 0.233606 0.251414 0.245559 0.318316 0.254746 0.231249 0.228398 0.228199 0.231539
chargesum: 0.00000
title: Mulliken charges with hydrogens summed into heavy atoms:
elementType: O N C C C C C C C C C C
charge: -0.245770 -0.084293 0.028669 0.016473 -0.015286 0.498939 0.147772 -0.135569 -0.214487 0.005804 0.007735 -0.009986
polarizability: 1.56577202e+02 -3.09363306e+00 1.02369839e+02 -3.25091893e+00 9.87687917e+00 7.39025072e+01
1716.lowfreq: -13.3786 -4.5546 0.0005 0.0006 0.0007 8.1521 43.1910 71.4349 97.0575
frequency: 43.0602 71.3941 97.0303 156.3148 228.9912 280.1562 308.1266 404.0970 446.9678 508.3256 531.5466 582.4875 609.7389 614.2656 644.6003 676.8865 707.8117 767.5786 812.2557 820.1165 857.1687 887.3957 918.4658 933.9990 980.5366 989.9379 997.6734 999.3146 1025.6083 1034.9973 1072.6828 1094.8133 1138.6173 1172.9590 1184.2602 1194.0509 1215.0972 1246.0730 1269.2734 1290.5785 1295.7765 1313.6871 1350.1084 1379.0579 1390.5245 1445.0173 1452.8875 1475.3509 1483.1976 1595.7238 1614.2424 1666.3833 2942.5641 3011.5233 3022.6458 3085.5188 3098.7261 3114.4108 3122.8900 3135.1380 3146.8365 3164.2344 3565.7139
redmass: 3.9809 5.1814 3.5554 2.3188 4.5321 4.1852 5.6189 2.8224 4.8450 1.7086 2.9505 3.4257 2.4192 6.3709 2.7121 3.1016 1.7425 1.8574 3.7676 2.1082 1.2467 3.1444 1.7483 1.7962 1.3854 5.8529 1.8402 1.4913 2.1057 2.0258 2.0802 2.0873 1.4252 1.0552 1.1105 1.4137 2.2326 1.9983 1.3543 1.4534 1.3334 1.7188 1.5191 1.9320 4.6385 2.0873 1.0895 1.1084 2.2853 6.0673 6.1288 8.7085 1.0848 1.0644 1.0629 1.0995 1.1025 1.0878 1.0862 1.0907 1.0959 1.1014 1.0785
irintensity: 1.2591 1.7485 0.3486 0.6722 0.4707 3.4422 0.0247 0.4812 12.7452 21.0295 12.6543 25.5717 37.5689 0.1138 62.1344 24.1911 48.6841 53.0709 2.1706 9.7749 0.2236 2.8846 1.1682 3.8324 0.1005 0.6350 5.0535 1.3744 6.7696 11.9641 10.8167 6.4462 22.4845 0.1389 2.0998 15.7206 1.6505 121.4936 9.5650 23.8251 12.7877 16.3026 4.2211 40.1361 2.4014 15.7138 5.2175 11.0772 11.9829 0.4209 5.2155 488.3429 42.1817 20.9607 18.6887 11.3116 24.3107 10.1070 1.8324 8.7424 36.3889 23.1695 23.0423
temp: 298.150 k
press: 1.00000 atm
elementType: 8 7 6 6 6 6 6 6 6 6 6 6 1 1 1 1 1 1 1 1 1 1 1
symmnumber: 1
zpe: 494580.6 jmol-1
zpe.correction: 0.188376 hartree
zpe.thermalcorrener: 0.198364 hartree
zpe.thermalcorrenthalpy: 0.199308 hartree
zpe.thermalcorrgfe: 0.151940 hartree
zpe.sumelectzpe: -516.790218 hartree
zpe.sumelectthermal: -516.780230 hartree
zpe.sumelectthermalent: -516.779286 hartree
zpe.sumelectthermalfe: -516.826653 hartree
dipole: 3.8217 -2.4592 0.5504
dipole: 4.5777
quadrupole: -83.0147 -67.7848 -69.5839
quadrupole: 10.1445 -4.3707 3.3396
quadrupole: -9.5536 5.6763 3.8772 10.1445 -4.3707 3.3396
hfenergy: -516.9785933 hartree
pointgroup: C01 [X(C10H11N1O1)]
dipole: -1.5038974 -0.9770505 -0.165336 debye
dipolederiv: -1.167547 -0.3012524 -0.0277619 -0.5804352 -0.7142354 -0.1281889 -0.1223828 -0.1665305 -0.4596787 -1.4311014 -0.1796308 0.0499265 0.111815 -0.4064409 0.0242063 0.1852508 0.0647924 -0.4152474 0.5028379 0.0950438 0.089913 0.276177 0.4215168 -0.0588712 0.3766453 -0.0412294 0.2710192 -0.0357828 0.0685448 0.0528285 -0.0727165 0.1282643 -0.0484401 -0.0752586 -0.0039965 0.0296411 -0.0187476 -0.0168063 0.021833 -0.0354621 -0.1880788 -0.2566441 0.0715855 -0.2625514 -0.0385749 0.2467273 -0.0840161 -0.0275839 -0.0864558 -0.0668504 -0.0031774 -0.0365575 -0.0048558 -0.0683061 1.8877734 0.4617449 -0.1658847 0.4425144 0.749131 0.3446316 -0.3765071 0.2912059 0.4828435 -0.110445 0.0738448 -0.0301872 0.1186598 -0.0667272 -0.0598444 -0.0470077 -0.05115 -0.1113498 -0.164541 -0.0125245 0.0253995 -0.0091859 0.0239581 -0.1102168 -0.007123 -0.0983123 -0.1007883 -0.0179162 -0.0253523 0.0195467 -0.0464284 0.069181 -0.1192277 0.0259855 -0.1228289 -0.0766948 0.0513793 0.0705687 -0.0440605 0.09336 -0.0100796 -0.0773665 -0.0519567 -0.0766616 -0.0944133 0.0488754 -0.0431028 0.0304308 -0.0442435 -0.0926315 -0.0465047 0.0276812 -0.0426872 -0.1408237 -0.0334778 -0.0412903 0.0114678 -0.0756169 -0.1134856 0.1026985 -0.0218044 0.0991451 -0.0740636 0.0258355 0.0242893 -0.0678236 0.0327292 0.0321673 0.1028965 -0.0911974 0.0472329 -0.0401035 0.0474267 -0.0655476 -0.0120567 -0.0345873 -0.132084 -0.0625624 -0.0018603 -0.0165988 0.0759506 -0.0107926 -0.0191477 0.0630672 -0.0503797 0.0927532 0.0526764 0.0884346 0.0166105 -0.0398462 -0.0058628 0.0473394 -0.0489627 0.0900007 -0.0174642 0.0395236 -0.0826748 0.0678839 0.0459221 0.1992706 -0.0350311 0.0547211 -0.0861319 0.1865677 -0.0814383 0.1090079 -0.081658 0.2229825 0.0089161 -0.0844426 0.0492594 -0.0959489 0.0605383 0.0503912 0.0682376 0.0481414 0.1077529 0.0828016 0.0645675 -0.0446449 0.0414331 -0.0349654 0.1079559 -0.0281201 0.1077502 0.0809103 0.0614583 0.0352891 -0.0205562 0.0510236 -0.0477468 0.114675 -0.0376726 0.1143905 0.0893375 -0.0499116 -0.0868951 0.0520907 -0.0976061 0.0341631 0.0723332 0.0579913 0.0721731 0.1138812 -0.1171761 0.0538074 -0.0309619 0.0574852 0.092549 0.0404945 -0.0306967 0.0397346 0.1396493 unknown
polarizability: 156.652401|2.8724263|100.8717042|-2.6308149|-11.6967164|75.3254424 unknown
InChI: InChI=1S/C10H11NO/c12-10-7-6-9(11-10)8-4-2-1-3-5-8/h1-5,9,11H,6-7H2
charge 0 multiplicity 1
23 atoms
O  3.750419 1.182057 0.503344
N  1.538954 0.416308 0.814354
C  0.643214 -0.691397 0.421039
C  1.348139 -1.214746 -0.881428
C  2.83622 -0.824837 -0.707644
C  -0.804085 -0.259451 0.214317
C  2.810079 0.382073 0.25052
C  -1.114567 0.938122 -0.480397
C  -1.863104 -1.07157 0.687853
C  -2.458337 1.310618 -0.700369
C  -3.209724 -0.704614 0.462672
C  -3.511252 0.488563 -0.232459
H  0.664007 -1.488982 1.194762
H  0.914188 -0.695272 -1.753686
H  1.185703 -2.296678 -1.015083
H  3.342153 -0.551949 -1.647469
H  3.429389 -1.628849 -0.232373
H  1.299585 1.083983 1.548926
H  -0.299812 1.5798 -0.837132
H  -1.633531 -1.994185 1.236319
H  -2.686579 2.240094 -1.234159
H  -4.019368 -1.342804 0.83392
H  -4.553991 0.778416 -0.403226
