program: Gaussian 09
title: 000095652
version: EM64L-G09RevD.01
frameworkgroup: C1[X(C4H6O3)]
method: RPBEPBE
basis: SDD
operation: Freq
keyword: #p
keyword: freq=noraman
keyword: PBEPBE/SDD
title: #p freq=noraman PBEPBE/SDD
converged: NO NO NO NO
title: Mulliken charges:
elementType: O O O C C C C H H H H H H
charge: -0.203914 -0.437491 -0.201974 -0.102201 -0.556856 -0.308970 0.233619 0.229955 0.266385 0.251311 0.266090 0.220040 0.344006
chargesum: 0.00000
title: Mulliken charges with hydrogens summed into heavy atoms:
elementType: O O O C C C C
charge: -0.203914 -0.093485 -0.201974 0.127754 -0.039159 0.177160 0.233619
polarizability: 5.66251362e+01 -4.87201759e+00 5.04236738e+01 -2.10451117e+00 2.86778522e-01 4.02539908e+01
1716.lowfreq: -23.2645 -8.0507 -0.0008 0.0006 0.0009 15.6217 96.0597 166.6174 303.7660
frequency: 95.9777 166.6099 303.7639 373.8473 380.2950 467.3323 514.8022 646.6377 731.2081 793.5430 823.0570 880.6822 929.2262 964.2264 1027.0973 1057.1911 1099.8551 1143.1024 1170.0797 1205.5251 1249.6618 1306.7107 1337.6282 1363.6707 1433.0798 1459.6328 1716.0674 2996.1142 3017.2432 3041.1658 3097.5079 3128.7250 3566.6649
redmass: 4.1304 4.3193 1.1232 2.4395 3.0097 4.8495 3.3080 7.6339 5.5824 5.7696 3.1905 2.0500 3.1377 3.1132 2.2480 2.3303 3.6366 1.1786 1.1456 1.1925 1.5865 1.3443 1.3716 1.5000 1.0944 1.0867 12.6150 1.0814 1.0682 1.0633 1.0981 1.1067 1.0663
irintensity: 3.8958 1.9144 166.4915 1.7351 11.5959 2.4926 6.0560 8.7006 7.1949 31.6277 21.7808 10.2039 74.3619 24.4124 41.4415 82.1064 121.7233 11.2739 42.4865 1.0300 34.5528 16.3541 3.2877 4.2923 24.2380 6.8139 331.7906 34.3519 12.9326 52.6288 5.1908 9.1816 6.6695
temp: 298.150 k
press: 1.00000 atm
elementType: 8 8 8 6 6 6 6 1 1 1 1 1 1
symmnumber: 1
zpe: 260115.6 jmol-1
zpe.correction: 0.099073 hartree
zpe.thermalcorrener: 0.105544 hartree
zpe.thermalcorrenthalpy: 0.106489 hartree
zpe.thermalcorrgfe: 0.068574 hartree
zpe.sumelectzpe: -381.132963 hartree
zpe.sumelectthermal: -381.126491 hartree
zpe.sumelectthermalent: -381.125547 hartree
zpe.sumelectthermalfe: -381.163462 hartree
dipole: -4.4105 -1.6933 3.2712
dipole: 5.7464
quadrupole: -50.0052 -36.3535 -40.2088
quadrupole: 1.9536 0.2180 1.3468
quadrupole: -7.8161 5.8357 1.9804 1.9536 0.2180 1.3468
hfenergy: -381.2320358 hartree
pointgroup: C01 [X(C4H6O3)]
dipole: -1.7332273 -0.7252037 1.257456 debye
dipolederiv: -0.8281114 0.2563696 0.1066854 0.5872014 -0.9341656 -0.0046919 0.0053099 0.0863896 -0.3109888 -0.7234455 -0.0136219 -0.1138011 -0.0138712 -0.2203062 -0.2174245 -0.162061 -0.2072032 -0.6235518 -1.1280538 0.2560585 0.17261 0.1677535 -0.5436366 0.0042221 0.2249244 -0.0234739 -0.3882735 0.5111474 0.0912026 0.1195694 0.0046532 0.203188 0.182458 0.1799993 0.1579724 0.5656378 -0.3262364 -0.1105237 0.0943879 -0.0279636 -0.1884047 0.1721576 0.1317989 0.1208054 -0.0282169 0.5776698 -0.1733586 -0.0772395 -0.0284093 0.1589506 0.0135012 -0.1295524 0.1412762 0.3206113 1.5136035 -0.319228 -0.3169559 -0.6236673 1.2680985 -0.0999362 -0.2808936 -0.2038609 0.3626956 -0.0988651 -0.0304159 0.0950688 -0.0378001 0.05961 0.0077734 0.0811625 -0.0173507 -0.1589864 0.0747206 -0.0031542 -0.0026402 -0.0042043 -0.0477749 -0.0429416 -0.0105412 -0.0804541 0.100162 0.0450805 -0.0114795 -0.0463936 -0.0018428 0.120998 -0.0221189 -0.0486001 0.0181157 -0.0673728 -0.0079247 0.069335 -0.0248627 0.0514373 0.069956 0.0362504 -0.0552298 0.0662499 0.0340605 -0.0071914 0.0082456 0.0086445 -0.0046097 0.0320208 -0.0788557 0.0671004 -0.1457305 -0.086669 0.3976064 -0.0194296 -0.0150731 -0.0686772 0.0214661 0.0496062 -0.0034174 0.0872641 0.280892 unknown
polarizability: 56.9586705|-4.6733438|50.1437573|-1.9090883|0.2304145|40.200373 unknown
InChI: InChI=1S/C4H6O3/c5-3-1-4(6)7-2-3/h3,5H,1-2H2
charge 0 multiplicity 1
13 atoms
O  0.596263 1.184901 -0.195734
O  -1.909713 -0.606344 -0.822349
O  2.295473 -0.400089 -0.297524
C  -1.266461 -0.237314 0.446797
C  0.062189 -0.982366 0.682668
C  -0.817518 1.229568 0.273911
C  1.131898 -0.109389 0.010532
H  -1.976857 -0.352789 1.288672
H  0.090001 -2.004505 0.272806
H  0.304036 -1.043387 1.761098
H  -1.409054 1.734036 -0.5038
H  -0.843422 1.793992 1.221469
H  -2.134034 -1.571215 -0.816648
