program: Gaussian 09
title: 000095667
version: EM64L-G09RevD.01
frameworkgroup: C1[X(C9H11BrO)]
method: RPBEPBE
basis: SDD
operation: Freq
keyword: #p
keyword: freq=noraman
keyword: PBEPBE/SDD
title: #p freq=noraman PBEPBE/SDD
converged: YES YES NO NO
title: Mulliken charges:
elementType: Br O C C C C C C C C C H H H H H H H H H H H
charge: -0.018218 -0.257101 0.354062 0.439801 -0.367625 -0.342038 -0.329706 -0.421186 -0.210446 -0.807857 -0.687796 0.250718 0.239834 0.230779 0.227328 0.217562 0.237650 0.222615 0.230163 0.228408 0.268566 0.294486
chargesum: 0.00000
title: Mulliken charges with hydrogens summed into heavy atoms:
elementType: Br O C C C C C C C C C
charge: -0.018218 -0.257101 0.354062 0.439801 -0.116907 -0.102204 -0.098927 -0.193858 0.244766 -0.126672 -0.124744
polarizability: 1.60619550e+02 5.39357213e-01 1.06894144e+02 4.96060836e+00 -2.70214605e+00 7.37857239e+01
1716.lowfreq: -7.3490 -0.4721 0.0006 0.0006 0.0009 3.4705 22.0812 30.6066 47.7144
frequency: 18.4424 30.5921 47.5867 92.0097 135.6493 159.8032 248.0036 309.3242 329.5065 366.3463 413.7812 416.8352 507.2781 538.2317 544.1109 633.0026 710.2340 711.2852 797.9203 807.0999 829.9797 868.0167 928.5545 955.7675 964.5781 983.2571 993.0680 1006.3679 1047.5475 1079.5111 1121.6446 1164.9452 1182.5077 1213.1371 1216.7530 1225.8084 1278.6153 1306.4214 1365.5591 1381.2218 1399.0117 1414.7475 1428.1012 1461.0177 1470.1518 1476.9750 1503.5929 1587.8859 1626.8134 2928.0520 2974.2063 3011.9352 3050.9161 3063.9521 3081.8414 3123.2879 3125.5534 3149.0451 3159.1602 3165.5053
redmass: 1.0542 6.8924 4.2827 5.2933 3.4754 4.8432 2.1952 2.9269 4.2471 4.1135 2.9512 3.4291 2.4720 4.8109 3.8678 6.6968 3.3867 2.9972 3.6569 1.4372 1.3600 2.6723 1.3365 2.0311 1.3659 1.4688 1.7242 2.6322 1.5294 2.5339 1.2657 1.2111 1.2731 1.3430 1.9107 4.4262 1.1847 1.2912 2.2532 1.9826 1.2533 3.4344 1.1182 1.1031 1.0456 1.0990 2.5509 6.4882 6.4188 1.0618 1.0372 1.0978 1.0977 1.0577 1.0984 1.0893 1.0890 1.1100 1.0940 1.0954
irintensity: 0.6045 0.5880 0.3382 2.8835 2.3479 0.3477 3.8416 0.6976 5.0693 4.1693 0.0664 1.4553 20.7030 13.0933 12.8576 0.0280 8.4407 2.4579 1.7641 45.0727 29.9251 17.9280 1.7949 45.7905 2.8945 7.1327 22.2327 8.4323 11.2669 10.7430 17.0786 0.1917 70.1720 35.3831 123.4134 91.3100 38.3104 1.2123 5.3729 12.5622 11.1710 4.5665 16.8812 44.0235 12.4108 12.6020 131.3964 12.4158 28.2572 43.7568 45.6615 22.1901 23.6154 19.5901 20.1281 16.9149 24.0652 4.5703 19.1238 3.7086
temp: 298.150 k
press: 1.00000 atm
elementType: 35 8 6 6 6 6 6 6 6 6 6 1 1 1 1 1 1 1 1 1 1 1
symmnumber: 1
zpe: 461352.1 jmol-1
zpe.correction: 0.175720 hartree
zpe.thermalcorrener: 0.187188 hartree
zpe.thermalcorrenthalpy: 0.188132 hartree
zpe.thermalcorrgfe: 0.134648 hartree
zpe.sumelectzpe: -437.405868 hartree
zpe.sumelectthermal: -437.394399 hartree
zpe.sumelectthermalent: -437.393455 hartree
zpe.sumelectthermalfe: -437.446940 hartree
dipole: -1.4717 2.6092 0.6559
dipole: 3.0666
quadrupole: -72.3069 -67.7366 -76.3391
quadrupole: 6.3060 4.5287 -0.6130
quadrupole: -0.1794 4.3909 -4.2116 6.3060 4.5287 -0.6130
hfenergy: -437.5815876 hartree
pointgroup: C01 [X(C9H11Br1O1)]
dipole: -0.4577599 -0.9903615 -0.5150232 debye
dipolederiv: -0.282602 -0.0852309 -0.0714659 -0.1645181 -0.2309583 -0.1066194 -0.1789264 -0.1431837 -0.2869974 -1.9425976 0.1619359 0.0591169 0.2456167 -0.3142059 0.0135342 0.1589153 0.015335 -0.2701808 1.6470516 -0.0203905 -0.0723837 0.1511436 0.0248323 0.0044928 -0.2136935 0.0109165 0.0906721 0.2807454 0.0270522 -0.0432095 -0.0438303 -0.1843711 0.0260904 -0.0372028 0.0184365 -0.051755 -0.3666628 -0.0297459 0.0067702 0.2234007 0.0350836 -0.0573718 -0.0186669 -0.0238591 -0.159733 -0.3079194 0.0486167 -0.0150809 -0.292537 -0.0372064 -0.0086578 0.0744424 -0.0340746 -0.1955135 0.028122 0.0249063 -0.0263269 -0.0839699 0.1442916 -0.0403936 -0.00698 -0.0530841 -0.1580469 -0.0041659 -0.086266 0.0017021 0.1087651 0.1288424 -0.0564105 -0.0343488 -0.0414349 -0.1514256 0.7660148 -0.185501 0.0324789 -0.7693552 0.3164182 -0.0517086 -0.0660579 -0.0714348 0.2434362 -0.0987771 0.0027264 0.0191432 0.0754597 0.0837426 -0.00628 0.0161566 -0.0007041 0.0788801 0.2331297 0.1743765 0.2017805 0.2894267 0.3240228 0.2739478 0.3223672 0.2714282 0.4236409 0.0606743 -0.0743938 0.0254842 -0.0714591 -0.0169102 0.0376343 0.0210779 0.0361035 0.1577297 0.0124595 0.1057103 0.0033986 0.1296733 -0.0191065 0.0256997 -0.0065805 0.0187881 0.1605312 0.0005287 0.1094188 -0.0065508 0.1048402 -0.0454969 0.0225879 -0.0014682 0.020374 0.1439394 0.0203432 -0.090789 0.0262642 -0.0902295 -0.0686999 0.044565 0.0278971 0.0467865 0.1393487 -0.0815615 -0.0934251 -0.0964594 0.1201221 -0.0702769 -0.1038847 0.0132314 -0.1075105 -0.0259619 0.0148026 -0.0166813 0.0435203 0.1380946 -0.0032151 0.0685803 0.0024577 0.1090351 -0.0738096 0.0453523 -0.0112858 0.0076818 -0.1294591 -0.1271417 0.0452131 0.0241819 0.0352904 0.099414 -0.0231298 0.0169585 0.0500093 0.0546227 0.0283095 -0.1186096 0.1173406 -0.0946896 -0.0383532 -0.0585982 0.0184645 -0.0608638 0.0417567 0.0769488 0.0814112 -0.1341981 0.062215 -0.0526271 -0.0333001 0.0269612 -0.0301237 0.0601133 -0.0669222 -0.0864988 -0.043077 -0.0826418 0.0289606 0.0900902 -0.023418 -0.0548855 -0.0976773 0.0220193 -0.0073218 -0.0368683 0.0079084 -0.1021489 unknown
polarizability: 160.4440549|4.2264044|106.9282833|3.008192|4.4012572|73.9270798 unknown
InChI: InChI=1S/C9H11BrO/c1-8-2-4-9(5-3-8)11-7-6-10/h2-5H,6-7H2,1H3
charge 0 multiplicity 1
22 atoms
Br 4.439801 0.762149 0.993765
O  1.45224 0.341868 -0.486991
C  0.069928 0.138865 -0.296368
C  -2.757208 -0.040349 0.036999
C  -0.732668 1.300921 -0.404562
C  -0.529337 -1.112723 -0.021775
C  -2.125835 1.204397 -0.239819
C  -1.934205 -1.185545 0.141334
C  2.328369 -0.819424 -0.340583
C  -4.263595 -0.12485 0.216318
C  3.758771 -0.354653 -0.552356
H  -0.245137 2.258328 -0.612741
H  0.067268 -2.025856 0.066813
H  -2.736954 2.111466 -0.324754
H  -2.39224 -2.158964 0.354926
H  2.086303 -1.576041 -1.121456
H  2.200959 -1.286933 0.656215
H  -4.590953 -1.163003 0.398758
H  -4.603468 0.488577 1.072377
H  -4.798855 0.24349 -0.679244
H  4.449621 -1.209324 -0.613465
H  3.847595 0.289702 -1.439288
