program: Gaussian 09
title: 000095666
version: EM64L-G09RevD.01
frameworkgroup: C1[X(C9H6Cl2N2O2)]
method: RPBEPBE
basis: SDD
operation: Freq
keyword: #p
keyword: freq=noraman
keyword: PBEPBE/SDD
title: #p freq=noraman PBEPBE/SDD
converged: YES YES NO NO
title: Mulliken charges:
elementType: Cl Cl O O N N C C C C C C C C C H H H H H H
charge: -0.003709 0.003875 -0.191643 -0.217674 -0.425082 -0.396230 -0.308398 0.521573 0.186659 0.186296 -0.358020 -0.389368 -0.070815 -0.196004 -0.112920 0.276781 0.338822 0.357850 0.282922 0.252646 0.262437
chargesum: 0.00000
title: Mulliken charges with hydrogens summed into heavy atoms:
elementType: Cl Cl O O N N C C C C C C C C C
charge: -0.003709 0.003875 -0.191643 -0.217674 -0.086260 -0.038380 -0.031617 0.521573 0.186659 0.186296 -0.075098 -0.136721 -0.070815 0.066433 -0.112920
polarizability: 1.80329296e+02 -9.00570898e+00 1.41739696e+02 2.62190861e+00 3.56968996e+00 7.37644566e+01
1716.lowfreq: -6.6112 -0.0016 -0.0012 0.0020 4.3572 7.2800 21.7469 49.9246 60.1987
frequency: 21.2974 49.9204 60.1958 122.2504 155.1904 175.0745 184.4894 193.9198 259.5837 313.2079 366.0671 387.2801 416.0303 440.7467 453.4429 494.0148 523.8113 556.1913 602.1846 621.9503 655.3726 663.6763 695.2269 712.9953 720.4451 740.6010 815.8879 857.7836 903.7585 916.5747 955.6526 959.0332 1004.5327 1077.9898 1117.2846 1148.5277 1174.9288 1196.9400 1212.5594 1247.2026 1290.0585 1313.5853 1328.3131 1365.8420 1377.7488 1390.6791 1459.1235 1573.9093 1596.7823 1689.9261 1729.4502 2986.2426 3149.8070 3159.9937 3176.0402 3587.9709 3607.2133
redmass: 9.7890 10.3432 11.4544 6.4628 7.6580 14.1752 10.2571 10.6336 11.6144 7.3258 7.8473 7.6585 8.8045 3.0030 6.9560 1.3610 3.3340 4.0955 10.5854 4.1125 4.6870 1.5683 5.0853 4.9952 6.9969 5.0317 1.5766 3.0248 3.1922 2.0300 1.4763 2.7901 5.2322 2.2744 2.0829 1.4757 2.9246 2.7188 1.8770 1.3282 2.0912 1.6279 3.7549 1.9911 4.9617 2.3895 2.7186 7.9023 6.5895 8.6041 9.6126 1.0836 1.0898 1.0920 1.0964 1.0803 1.0803
irintensity: 0.4143 0.2230 0.8418 1.5183 3.0694 0.1493 0.2978 0.5297 0.6236 2.2020 8.4444 19.4099 4.5132 16.0749 23.7992 67.3738 55.6735 21.0061 11.7588 18.8876 5.0907 130.1721 6.4500 24.3923 58.2560 16.3204 23.6906 12.3132 15.5381 25.2342 4.3535 22.4133 39.4304 17.9317 37.6239 5.5101 71.0071 38.8599 73.7492 24.1126 75.2680 18.5240 137.4915 5.9021 5.3249 51.2309 72.5798 7.8870 8.8313 567.3525 387.9477 12.2328 3.2468 0.0792 1.6468 83.3940 49.4697
temp: 298.150 k
press: 1.00000 atm
elementType: 17 17 8 8 7 7 6 6 6 6 6 6 6 6 6 1 1 1 1 1 1
symmnumber: 1
zpe: 364600.9 jmol-1
zpe.correction: 0.138869 hartree
zpe.thermalcorrener: 0.151887 hartree
zpe.thermalcorrenthalpy: 0.152831 hartree
zpe.thermalcorrgfe: 0.097014 hartree
zpe.sumelectzpe: -1525.600242 hartree
zpe.sumelectthermal: -1525.587224 hartree
zpe.sumelectthermalent: -1525.586279 hartree
zpe.sumelectthermalfe: -1525.642097 hartree
dipole: -0.5085 -1.7897 -2.4656
dipole: 3.0888
quadrupole: -111.9407 -106.0806 -95.8903
quadrupole: 3.2311 0.2143 5.5557
quadrupole: -7.3035 -1.4434 8.7469 3.2311 0.2143 5.5557
hfenergy: -1525.7391107 hartree
pointgroup: C01 [X(C9H6Cl2N2O2)]
dipole: 0.1266025 -0.8201114 0.8877976 debye
dipolederiv: -0.1583924 0.1788793 -0.0246547 0.2690385 -0.6261537 0.0742001 -0.0429198 0.072035 -0.040163 -0.7856932 0.0457881 -0.0793143 0.0584067 -0.0591895 0.0088428 -0.0969807 0.0077436 -0.0365294 -0.5018762 -0.1170986 -0.0392852 -0.1301653 -0.8140824 -0.3388985 0.0659068 -0.4141577 -0.674906 -0.9876391 -0.4050647 0.0053786 -0.6483504 -0.8375134 -0.0905125 -0.0223274 -0.1236094 -0.4811913 -1.1765935 -0.1241981 0.2087666 -0.1550165 -0.4509853 0.1353447 0.2233554 0.0877055 -0.5725672 -0.8271132 -0.4324655 -0.2096377 -0.4158564 -1.0062323 -0.447433 0.0785712 -0.2932075 -0.6351367 0.3048675 0.0901567 0.2733539 0.2910808 0.3227632 -0.1024134 0.5737629 -0.0825892 -0.0520624 0.3061543 -0.0477952 -0.0864214 -0.0401458 -0.0184588 -0.0145694 -0.0422288 -0.0344028 -0.0900241 0.9507096 0.5775622 0.0289951 0.4509879 1.1436518 0.5035437 -0.5552065 0.4151653 0.7780033 1.5314393 0.6393286 -0.2872395 0.9463118 1.2629485 0.3903735 -0.3329703 0.4644244 1.1634149 -0.2186344 0.151912 0.0077958 0.0405829 -0.2195057 -0.0004397 0.0015706 0.0231711 -0.0898772 -0.0987704 -0.045249 0.0258794 0.0033925 0.0552111 -0.0122064 -0.0445862 0.0316604 -0.1243873 -0.0014109 -0.367389 0.027651 -0.3414569 0.9562511 -0.1097383 0.0342274 -0.1348487 -0.0153147 -0.2170204 0.0218805 -0.0063634 0.1127499 0.0173575 0.0006978 -0.0122451 -0.0003582 -0.0741349 1.1009015 0.0376955 0.1309317 -0.1054551 -0.1482828 -0.0002484 0.1544582 0.0129647 -0.0413394 0.0122661 -0.0247516 -0.0120773 -0.023957 -0.0703207 0.0668814 -0.0496499 0.0521809 0.0408797 0.2990256 -0.0670344 0.0552072 -0.1240262 0.2078613 -0.0514338 0.0959082 -0.0385607 0.2503226 0.2821356 -0.0655783 0.0289754 -0.1245199 0.2340507 -0.0564622 0.0034208 -0.0681936 0.2537405 0.097152 -0.0645507 -0.0128366 -0.0727721 0.0435672 0.0129252 0.0073504 0.0048166 0.1429943 0.0615654 0.0764994 -0.028978 0.064642 -0.0133687 0.0253495 -0.0210975 0.0125672 0.1389061 0.0269268 -0.0585273 -0.0061266 -0.0554713 0.0204309 0.0061971 -0.0183199 0.005493 0.1593722 unknown
polarizability: 181.5939968|5.0101894|140.4539798|3.7955512|3.4941904|73.7854714 unknown
InChI: InChI=1S/C9H6Cl2N2O2/c10-5-2-1-4(3-6(5)11)7-8(14)13-9(15)12-7/h1-3,7,12-13H
charge 0 multiplicity 1
21 atoms
Cl -2.728071 2.66447 -0.162498
Cl -4.770948 0.083031 -0.197963
O  1.699727 -2.033521 -1.491875
O  3.907505 1.706004 0.357406
N  2.047595 0.40985 1.093425
N  2.996433 -0.1432 -0.862676
C  1.278105 -0.752588 0.638378
C  -0.220218 -0.516749 0.457553
C  1.986306 -1.095298 -0.718013
C  3.077041 0.779393 0.231974
C  -0.733764 0.785788 0.267308
C  -1.101688 -1.624568 0.438345
C  -2.115477 0.977016 0.068267
C  -2.482222 -1.431535 0.232481
C  -2.992619 -0.128601 0.050488
H  1.426912 -1.62532 1.305508
H  1.914391 0.875693 1.98893
H  3.635564 -0.09389 -1.6566
H  -0.066172 1.65272 0.271456
H  -0.713094 -2.639836 0.568671
H  -3.169305 -2.28216 0.213533
