program: Gaussian 09
title: 000095668
version: EM64L-G09RevD.01
frameworkgroup: C1[X(C13H18O)]
method: RPBEPBE
basis: SDD
operation: Freq
keyword: #pfreq=noraman
keyword: PBEPBE/SDD
title: #p freq=noraman PBEPBE/SDD
converged: YES YES NO NO
title: Mulliken charges:
elementType: O C C C C C C C C C C C C C H H H H H H H H H H H H H H H H H H
charge: -0.458578 -0.042950 -0.446549 -0.462515 -0.399597 -0.406277 -0.384333 -0.289977 0.507494 -0.448771 -0.374117 -0.232887 -0.232311 -0.241755 0.237918 0.178256 0.233592 0.187907 0.199761 0.198881 0.195382 0.197181 0.199573 0.202394 0.187875 0.200729 0.335633 0.228308 0.258511 0.223343 0.222006 0.225872
chargesum: 0.00000
title: Mulliken charges with hydrogens summed into heavy atoms:
elementType: O C C C C C C C C C C C C C
charge: -0.122945 0.194968 -0.034701 -0.074846 -0.005335 -0.009523 0.005936 -0.089248 0.507494 -0.220463 -0.115606 -0.009544 -0.010304 -0.015883
polarizability: 1.68006114e+02 1.73530366e+01 1.21457721e+02 -9.97337083e+00 1.15649290e+01 1.17939753e+02
1716.lowfreq: -20.0030 -4.6011 0.0002 0.0005 0.0007 3.0994 29.1627 40.8277 64.2691
frequency: 29.1016 40.7560 64.2517 115.6681 195.5506 204.1263 218.4316 248.6983 304.3619 308.7577 331.7627 381.0632 404.0121 412.6780 429.7425 480.4643 529.2157 567.7478 611.3502 616.3732 704.5854 764.3868 787.4450 797.6853 803.8830 844.0039 855.0699 889.9550 895.7082 915.8119 922.5923 948.9325 976.5285 978.6495 990.3628 994.7576 1025.3148 1052.3414 1055.3698 1069.8600 1079.6188 1082.3446 1115.6602 1133.2775 1159.1406 1171.2611 1184.5615 1185.1499 1204.7575 1230.3580 1258.5176 1261.4764 1276.5939 1304.4349 1318.8401 1325.3327 1335.6350 1336.5012 1338.5447 1340.9430 1357.3320 1372.3081 1390.0475 1439.9230 1462.3693 1462.8814 1464.6947 1470.2090 1477.9348 1483.8905 1594.6714 1614.9140 2921.8995 2939.4174 2948.6273 2965.3580 2966.8999 2968.0552 2972.3328 3008.1113 3027.5309 3028.8302 3036.9417 3043.4246 3113.4616 3124.1257 3137.5647 3152.3918 3164.1898 3563.9101
redmass: 3.0682 3.7130 4.1272 3.0955 4.4054 3.9135 1.8084 2.8934 2.0215 1.2781 3.8340 3.7767 2.8291 2.0217 3.0421 2.3247 3.3104 2.2337 5.1297 6.2093 1.7341 1.9180 1.4873 2.8005 2.4903 2.1599 1.2488 1.7229 1.6695 1.9523 1.5321 2.4074 1.4132 4.0879 4.4957 1.4378 2.1996 1.8161 1.4517 2.2952 1.5157 1.4850 2.5116 1.9276 1.5450 1.0541 1.3945 1.1296 1.4626 1.3995 1.2808 1.2356 1.2772 1.2480 1.3669 1.2877 1.2939 1.3530 1.4979 1.5107 1.4750 2.2034 3.3128 2.1302 1.0849 1.0889 1.0900 1.0820 1.0951 2.3897 6.1320 6.1308 1.0832 1.0605 1.0676 1.0620 1.0653 1.0642 1.0786 1.0974 1.0958 1.1001 1.0980 1.1012 1.0865 1.0868 1.0923 1.0958 1.1003 1.0654
irintensity: 0.0817 0.2062 0.2583 1.2236 0.9170 3.8479 0.0667 35.3177 4.0674 131.9684 3.0357 1.3930 0.4040 0.9381 0.3136 3.3580 0.1459 18.2376 13.7105 1.0566 55.5714 53.3213 1.7170 8.4028 1.9631 10.0934 0.0493 1.4445 19.5218 0.9921 10.6973 12.7832 0.9881 48.0294 0.0974 0.4667 6.8613 5.0940 0.4719 5.5828 5.3840 2.8228 0.2852 6.4674 55.0032 0.3727 7.1051 4.2396 0.2165 7.5611 2.2046 7.3702 1.2872 7.9228 13.6159 0.1498 2.0367 0.8561 3.9518 2.0963 4.9342 8.0351 5.3784 10.7366 1.8823 7.4629 7.2261 18.4498 1.2895 10.0442 0.6433 3.4466 30.1539 35.6635 21.5887 37.3493 29.8596 21.7323 36.5719 67.4318 82.2914 40.7770 19.4114 108.7942 9.0545 1.2411 31.0416 32.0726 15.3711 3.1397
temp: 298.150 k
press: 1.00000 atm
elementType: 8 6 6 6 6 6 6 6 6 6 6 6 6 6 1 1 1 1 1 1 1 1 1 1 1 1 1 1 1 1 1 1
symmnumber: 1
zpe: 730227.8 jmol-1
zpe.correction: 0.278129 hartree
zpe.thermalcorrener: 0.291180 hartree
zpe.thermalcorrenthalpy: 0.292124 hartree
zpe.thermalcorrgfe: 0.237776 hartree
zpe.sumelectzpe: -580.338096 hartree
zpe.sumelectthermal: -580.325045 hartree
zpe.sumelectthermalent: -580.324101 hartree
zpe.sumelectthermalfe: -580.378449 hartree
dipole: 1.9827 -0.9880 -0.3376
dipole: 2.2408
quadrupole: -81.7218 -87.1365 -81.1503
quadrupole: 7.2299 -3.0054 1.9650
quadrupole: 1.6144 -3.8002 2.1859 7.2299 -3.0054 1.9650
hfenergy: -580.616225 hartree
pointgroup: C01 [X(C13H18O1)]
dipole: 0.7821927 0.3930579 0.1043077 debye
polarizability: 168.1118988|-16.8125594|122.7872125|10.43946|11.4370613|116.5044763 unknown
InChI: InChI=1S/C13H18O/c14-13(11-7-3-1-4-8-11)12-9-5-2-6-10-12/h1,3-4,7-8,12-14H,2,5-6,9-10H2
charge 0 multiplicity 1
32 atoms
O  -0.107765 -2.391752 0.576415
C  1.200242 -0.33344 -0.042231
C  1.387757 1.173172 0.274875
C  2.520265 -1.104714 0.226498
C  2.583419 1.786763 -0.491232
C  3.719302 -0.48919 -0.535567
C  3.891267 1.011722 -0.208973
C  0.007347 -0.929415 0.772932
C  -1.334893 -0.34321 0.36087
C  -1.961636 0.662201 1.135351
C  -1.963291 -0.785625 -0.830515
C  -3.190086 1.228812 0.723252
C  -3.192214 -0.225653 -1.241711
C  -3.808362 0.7876 -0.468817
H  0.952841 -0.437573 -1.120352
H  1.560926 1.291047 1.367104
H  0.459918 1.725875 0.03744
H  2.416661 -2.165988 -0.078219
H  2.734215 -1.089321 1.318031
H  2.699703 2.852468 -0.213838
H  2.371991 1.760739 -1.580295
H  3.551539 -0.605927 -1.626304
H  4.644918 -1.046332 -0.292448
H  4.727288 1.437946 -0.796671
H  4.159594 1.125161 0.862158
H  0.192361 -0.710425 1.849971
H  0.735675 -2.816946 0.874699
H  -1.492593 0.999022 2.068577
H  -1.496298 -1.590477 -1.407586
H  -3.66543 2.00518 1.333575
H  -3.673639 -0.58101 -2.160111
H  -4.763025 1.221389 -0.787679
