program: Gaussian 09
title: 000095641
version: EM64L-G09RevD.01
frameworkgroup: C1[X(C10H12O2)]
method: RPBEPBE
basis: SDD
operation: Freq
keyword: #pfreq=noraman
keyword: PBEPBE/SDD
title: #p freq=noraman PBEPBE/SDD
converged: YES YES NO NO
title: Mulliken charges:
elementType: O O C C C C C C C C C C H H H H H H H H H H H H
charge: -0.261023 -0.440385 0.512852 -0.397399 -0.383151 0.318053 -0.353855 -0.363675 -0.326938 -0.224675 -0.384453 -0.537977 0.224400 0.230018 0.239834 0.251260 0.222225 0.238484 0.219971 0.189911 0.222278 0.222430 0.246735 0.335081
chargesum: 0.00000
title: Mulliken charges with hydrogens summed into heavy atoms:
elementType: O O C C C C C C C C C C
charge: -0.261023 -0.105304 0.512852 -0.173000 -0.153133 0.318053 -0.114021 -0.112415 -0.104712 0.013808 0.025429 0.153466
polarizability: 2.19368878e+02 -3.61677071e+00 1.09079158e+02 -5.48508173e+00 3.19264020e+00 6.25996151e+01
1716.lowfreq: -8.8469 -3.4638 -0.0008 -0.0007 -0.0006 6.6837 40.5539 58.5482 93.3097
frequency: 40.5451 58.5357 93.3069 106.3353 122.3980 194.1514 227.7784 245.4500 288.4917 332.7464 360.6477 393.3573 413.9787 440.8134 496.1548 529.7205 552.4110 632.5669 730.1112 737.9305 812.2818 815.9788 829.3474 857.2868 920.6490 942.2361 957.0720 962.5726 986.5589 987.3081 1001.4358 1096.4756 1112.1015 1117.1312 1153.3997 1156.7146 1179.1560 1220.4226 1241.8755 1270.3282 1292.8918 1309.3524 1323.0076 1367.2399 1383.1520 1426.6481 1438.0996 1462.3171 1467.4905 1472.0300 1504.1867 1574.9352 1621.7306 1658.2118 2957.8193 2960.7317 3049.0544 3055.4673 3070.1690 3111.3336 3124.5599 3126.2852 3134.9612 3161.8679 3167.7433 3548.6401
redmass: 3.9285 3.8124 3.9771 2.8662 3.3121 2.1390 2.2010 1.6481 4.6099 3.0899 1.4234 2.3610 2.8718 4.4577 3.1925 3.0879 3.9221 6.9329 3.2386 4.6032 1.4203 1.5381 3.6735 1.9408 2.7665 1.3801 2.4853 1.3553 1.1663 8.3999 2.5498 2.3801 1.2601 1.4279 1.1829 1.3395 1.2523 1.8140 3.1496 1.4304 1.3115 1.3405 1.4779 1.2922 3.0308 3.4310 1.2060 1.0945 1.0500 1.0745 2.5057 6.8595 6.2530 5.8912 1.0667 1.0331 1.1040 1.0951 1.0897 1.0902 1.0895 1.0992 1.0877 1.0948 1.0954 1.0662
irintensity: 1.9264 2.0713 4.8564 4.5179 0.7043 3.0807 1.8462 2.5228 1.8940 46.5178 99.6527 39.9687 3.5092 11.3521 15.7828 25.4379 9.6246 0.6901 0.1746 3.8768 31.7990 11.2608 11.6073 42.5653 121.8631 3.5761 8.3655 4.4340 50.3728 47.6040 8.7979 32.7757 0.1767 23.9857 9.5091 1.4140 83.6296 38.8082 183.6344 7.1042 2.0960 27.8911 12.9075 44.1118 36.4404 0.2464 10.4847 5.0737 13.7972 61.6749 109.7196 5.5793 112.1885 11.9987 81.6969 64.8840 48.4014 27.1899 21.8771 23.3783 18.8922 26.8572 7.0577 17.0577 6.1490 5.8646
temp: 298.150 k
press: 1.00000 atm
elementType: 8 8 6 6 6 6 6 6 6 6 6 6 1 1 1 1 1 1 1 1 1 1 1 1
symmnumber: 1
zpe: 510731.8 jmol-1
zpe.correction: 0.194527 hartree
zpe.thermalcorrener: 0.206630 hartree
zpe.thermalcorrenthalpy: 0.207574 hartree
zpe.thermalcorrgfe: 0.155524 hartree
zpe.sumelectzpe: -537.775423 hartree
zpe.sumelectthermal: -537.763321 hartree
zpe.sumelectthermalent: -537.762377 hartree
zpe.sumelectthermalfe: -537.814426 hartree
dipole: -2.9496 -0.5361 0.0750
dipole: 2.9988
quadrupole: -79.4841 -64.4884 -72.7371
quadrupole: 14.3465 -0.3245 1.3484
quadrupole: -7.2476 7.7481 -0.5005 14.3465 -0.3245 1.3484
hfenergy: -537.9699503 hartree
pointgroup: C01 [X(C10H12O2)]
dipole: 1.1530302 0.2499647 0.0050061 debye
dipolederiv: -1.9476663 -0.4467778 -0.0137249 -0.3982064 -0.442128 0.001329 -0.0428018 -0.0055725 -0.2989313 -0.9334817 -0.0223421 0.2540091 -0.0367658 -0.5251187 -0.146089 0.4603605 -0.1699837 -0.4562176 -0.1938237 -0.0568819 -0.0009529 -0.1152391 -0.1965616 0.0267627 -0.0198732 0.0293802 0.0344343 0.1554701 0.0861649 0.006327 0.0360316 0.1117713 -0.0410061 0.0179057 -0.0316946 -0.1264567 0.2139781 -0.0126737 0.0256743 -0.0338518 0.1285942 -0.0422617 0.029709 -0.0449647 -0.1647658 1.7281359 0.3285429 0.0376485 0.0275204 0.0669724 0.007702 0.0985755 0.0245371 0.0969328 -0.5173402 -0.0824905 -0.0001309 0.3580591 0.0140061 -0.0155127 -0.075791 -0.038537 -0.1971717 -0.3722844 -0.0754688 0.0042962 -0.4377673 -0.0245617 -0.0437513 0.0563586 -0.0271295 -0.1660578 0.5980852 0.0302449 0.0368889 0.1369467 0.1357074 -0.02266 0.06403 -0.0159154 -0.1561928 -0.4471907 0.0436182 0.0539679 0.072414 0.0496774 -0.0829092 -0.0062353 -0.0947034 -0.3108003 0.7597632 -0.0879011 -0.1217237 0.1316162 0.4014384 0.1211359 -0.2426548 0.1498529 0.5046048 0.5735257 0.1708773 -0.0151193 0.6250121 0.5151526 0.0023167 -0.0791147 -0.0179947 0.3259044 0.0206669 0.0990474 -0.0257382 0.0816962 -0.0214924 0.0293442 -0.0218308 0.0313844 0.1340603 0.0466653 -0.1041096 0.0077676 -0.072362 -0.070886 0.0290391 0.0036598 0.0263597 0.1471929 0.0374544 -0.0773621 0.0052274 -0.1013307 -0.0538719 0.0282494 0.006947 0.0291295 0.1614302 0.0195103 0.0849689 -0.0208888 0.0868293 0.0080954 0.0292022 -0.0226876 0.0295464 0.1654697 0.0150746 -0.0368049 -0.0011502 -0.1072433 -0.104315 0.0278989 0.0096834 0.0290948 0.1439048 0.0414601 -0.0718107 -0.002052 -0.0998933 -0.087484 0.0341586 -0.0535077 0.028125 0.1595636 -0.1283459 0.0398623 -0.0830871 0.0732901 0.0687305 0.0661391 -0.0360743 0.0143734 -0.0850668 0.0299522 0.0364492 0.0354006 -0.0869175 -0.2299182 -0.0485294 0.0298262 0.0069117 0.03127 0.0683255 0.0675138 0.0837355 -0.1284851 -0.0887836 -0.0967949 0.0366749 -0.1055532 -0.0516285 0.0792241 0.0291366 -0.0791405 -0.1415293 -0.029241 0.0737603 0.0244002 0.1021842 -0.1228639 -0.1723429 -0.0120734 -0.0153826 0.0301401 0.0851915 0.0080036 -0.0229129 0.0051456 0.1219387 0.3251845 0.0702703 -0.1718518 0.1000357 0.289025 0.0544725 -0.2146467 0.0460236 0.1094468 unknown
polarizability: 219.5728255|0.2635246|108.4570396|4.2114553|-5.6741147|63.0177856 unknown
InChI: InChI=1S/C10H12O2/c1-12-10-6-4-9(5-7-10)3-2-8-11/h2-7,11H,8H2,1H3
charge 0 multiplicity 1
24 atoms
O  3.779311 -0.008552 0.143386
O  -5.124477 0.653721 0.736807
C  -0.453223 -0.401074 -0.058792
C  0.143298 0.880109 -0.216966
C  0.417787 -1.50947 0.160217
C  2.381146 -0.063962 0.064836
C  1.53961 1.057942 -0.156726
C  1.811409 -1.352156 0.222597
C  -1.907821 -0.633861 -0.109872
C  -2.899233 0.288663 -0.291857
C  -4.36362 -0.064754 -0.314789
C  4.41859 1.299808 -0.016994
H  -0.489417 1.757168 -0.392841
H  -0.012716 -2.510987 0.283397
H  1.959398 2.060431 -0.283941
H  2.477216 -2.203862 0.39088
H  -2.2141 -1.685543 0.010376
H  -2.668587 1.35654 -0.408391
H  -4.849971 0.269629 -1.247983
H  -4.499926 -1.163235 -0.220129
H  4.095099 2.005968 0.772345
H  4.20499 1.733008 -1.013484
H  5.496843 1.105996 0.079111
H  -4.664306 0.505273 1.602613
