program: Gaussian 09
title: 000095683
version: EM64L-G09RevD.01
frameworkgroup: C1[X(C15H15NO2)]
method: RPBEPBE
basis: SDD
operation: Freq
keyword: #p
keyword: freq=noraman
keyword: PBEPBE/SDD
title: #p freq=noraman PBEPBE/SDD
converged: YES YES NO NO
title: Mulliken charges:
elementType: O O N C C C C C C C C C C C C C C C H H H H H H H H H H H H H H H
charge: -0.323135 -0.263022 -0.458976 0.136102 0.315603 0.320294 0.107191 -0.379211 0.172510 -0.409518 -0.795639 -0.326286 -0.250501 -0.222747 -0.323812 -0.235618 -0.249331 -0.527607 0.360476 0.249787 0.233701 0.311050 0.231975 0.210518 0.268781 0.230856 0.229438 0.238204 0.227397 0.225047 0.227258 0.243183 0.226031
chargesum: 0.00000
title: Mulliken charges with hydrogens summed into heavy atoms:
elementType: O O N C C C C C C C C C C C C C C C
charge: -0.323135 -0.263022 -0.098501 0.136102 0.315603 0.320294 0.107191 -0.129423 0.172510 -0.175817 -0.084365 -0.015236 -0.019645 0.006690 -0.085607 -0.008221 -0.024284 0.168864
polarizability: 2.68554106e+02 -1.39100573e+01 1.91376462e+02 -6.82368823e+00 -6.03081539e+00 9.44840390e+01
1716.lowfreq: -8.4845 -7.6201 -3.8027 -0.0006 -0.0004 0.0003 27.3103 39.1461 62.1492
frequency: 27.1580 39.1398 62.1414 81.8574 97.9418 112.4869 138.0737 167.3877 194.1132 200.5546 221.0976 251.2466 268.1022 311.5469 318.1181 380.6512 396.3585 449.8575 457.1587 482.1987 501.1023 545.2066 557.9871 560.4855 587.9358 658.8489 695.5117 727.2034 737.4131 742.0190 750.2744 756.8912 781.2348 787.2909 837.3184 853.0411 869.2576 879.5586 936.9487 953.6081 984.3708 991.2152 993.8943 995.5299 1038.5186 1046.2732 1049.7173 1065.0797 1109.2420 1115.9964 1138.2413 1151.2594 1172.3459 1177.3415 1198.9490 1211.2792 1246.4530 1255.6029 1285.5586 1302.1360 1370.9149 1391.3446 1403.9291 1423.0365 1426.1893 1448.8023 1454.7477 1463.2666 1465.7609 1473.0843 1477.8610 1485.3541 1512.0412 1574.2693 1592.1030 1602.5380 1609.8114 1612.6531 2965.9596 2990.6424 3055.9967 3075.9010 3093.4306 3119.7767 3125.6183 3126.3050 3135.5991 3141.7144 3152.8730 3162.2308 3168.7792 3196.5843 3499.3343
redmass: 3.8072 5.2890 4.7965 4.1125 3.5451 1.2444 2.8518 3.6638 2.9500 3.7242 2.1263 2.1898 3.6193 5.8767 3.9874 5.2407 3.1384 3.5304 3.2832 5.0712 4.1797 4.9792 5.3039 3.9196 5.8732 5.7861 5.2112 2.1138 4.0028 1.9036 1.4598 1.3019 2.6395 4.3645 4.3736 1.3893 4.7554 1.4671 1.3490 1.3952 1.3015 1.3378 1.6030 8.3564 2.1501 1.7200 2.1413 3.4927 1.9446 1.2573 1.6619 1.4048 1.0742 1.0719 2.3197 2.7032 3.2137 1.7923 1.4446 1.8865 7.7884 5.8118 1.2421 1.8660 1.6427 1.6775 1.0800 1.7531 1.0565 1.2548 1.3529 1.8404 2.5660 6.3915 6.1519 5.7278 6.4843 5.7862 1.0324 1.0367 1.1043 1.0967 1.1003 1.0858 1.0890 1.1001 1.0858 1.0937 1.0915 1.1008 1.0979 1.0952 1.0761
irintensity: 0.2073 1.8278 0.7072 0.7408 8.4922 0.8728 1.0263 4.5471 0.2009 1.3903 0.6783 1.4624 7.4391 3.3678 1.4290 2.6948 0.4021 6.5889 9.4314 4.9520 4.8810 9.0447 2.9235 1.1606 13.8578 11.2435 3.6944 13.2311 5.5823 54.1279 21.2404 159.8027 8.4594 4.6565 2.1777 1.3077 19.4473 3.8506 6.8517 1.4772 3.0286 0.2769 0.5595 53.7274 14.4053 14.9662 9.2214 16.1174 50.7438 0.1510 2.2078 0.3665 3.6584 1.4928 59.6047 3.8860 65.7455 84.5624 4.6205 71.6904 2.5378 79.0696 24.3019 60.4609 50.4131 86.9637 16.1834 78.4624 12.4656 37.4507 28.6245 30.5733 487.1785 27.4300 66.5464 12.2011 32.6165 36.9744 68.4186 23.4854 42.1392 19.7381 20.9019 8.9265 4.1536 18.2571 0.8799 31.2462 22.0359 31.5290 21.7226 7.2829 45.9407
temp: 298.150 k
press: 1.00000 atm
elementType: 8 8 7 6 6 6 6 6 6 6 6 6 6 6 6 6 6 6 1 1 1 1 1 1 1 1 1 1 1 1 1 1 1
symmnumber: 1
zpe: 692062.3 jmol-1
zpe.correction: 0.263593 hartree
zpe.thermalcorrener: 0.280051 hartree
zpe.thermalcorrenthalpy: 0.280996 hartree
zpe.thermalcorrgfe: 0.218529 hartree
zpe.sumelectzpe: -784.520807 hartree
zpe.sumelectthermal: -784.504349 hartree
zpe.sumelectthermalent: -784.503404 hartree
zpe.sumelectthermalfe: -784.565871 hartree
dipole: 1.3766 4.4562 1.1200
dipole: 4.7965
quadrupole: -84.6513 -97.1497 -109.1470
quadrupole: 3.9837 -0.8263 -1.9514
quadrupole: 12.3314 -0.1671 -12.1643 3.9837 -0.8263 -1.9514
hfenergy: -784.7844 hartree
pointgroup: C01 [X(C15H15N1O2)]
dipole: 0.3920574 -1.761705 0.5512253 debye
polarizability: 269.9990663|11.4104974|158.9159684|5.6276833|-44.7139462|125.4995723 unknown
InChI: InChI=1S/C15H15NO2/c1-11-7-3-4-8-12(11)15(17)16-13-9-5-6-10-14(13)18-2/h3-10,16H,1-2H3
charge 0 multiplicity 1
33 atoms
O  1.891335 -2.040139 0.561554
O  -0.549574 1.96905 -0.949363
N  0.338267 -0.053596 -0.156799
C  -2.083636 0.211921 -0.211877
C  -3.171068 0.458104 -1.108091
C  1.7292 0.209566 -0.208958
C  -0.7183 0.799585 -0.479136
C  -2.298836 -0.53835 0.976061
C  2.584132 -0.869319 0.18288
C  -4.437882 -0.087754 -0.780292
C  -3.008851 1.263079 -2.384531
C  2.311015 1.43596 -0.61059
C  -3.571058 -1.062169 1.286838
C  -4.646085 -0.837752 0.398845
C  3.984096 -0.725155 0.174673
C  3.718267 1.577562 -0.615616
C  4.55248 0.508529 -0.227529
C  2.683549 -3.200262 0.970008
H  0.107773 -1.009959 0.131455
H  -1.473078 -0.680612 1.683559
H  -5.276155 0.083028 -1.466042
H  1.653134 2.251911 -0.913932
H  -2.163218 0.898425 -2.995304
H  -3.927479 1.214644 -2.994279
H  -2.781533 2.318107 -2.155202
H  -3.722307 -1.627725 2.212534
H  -5.640929 -1.238385 0.623646
H  4.633962 -1.55235 0.475289
H  4.157657 2.530751 -0.927676
H  5.641525 0.623616 -0.235038
H  3.33898 -3.543492 0.146804
H  1.950077 -3.983143 1.212669
H  3.295341 -2.969974 1.863241
