program: Gaussian 09
title: 000009427
version: EM64L-G09RevD.01
frameworkgroup: C1[X(C9H11FN2O6)]
method: RPBEPBE
basis: SDD
operation: Freq
keyword: #p
keyword: freq=noraman
keyword: PBEPBE/SDD
title: #p freq=noraman PBEPBE/SDD
converged: YES YES NO NO
title: Mulliken charges:
elementType: F O O O O O O N N C C C C C C C C C H H H H H H H H H H H
charge: -0.161289 -0.256975 -0.466779 -0.438688 -0.444853 -0.313884 -0.212925 -0.182575 -0.405486 -0.191381 -0.138211 -0.071613 -0.049869 -0.361726 0.272586 -0.184961 0.174271 0.105448 0.239307 0.227341 0.293486 0.290064 0.197637 0.222681 0.397005 0.377541 0.353867 0.371078 0.358905
chargesum: 0.00000
title: Mulliken charges with hydrogens summed into heavy atoms:
elementType: F O O O O O O N N C C C C C C C C C
charge: -0.161289 -0.256975 -0.069774 -0.061147 -0.085949 -0.313884 -0.212925 -0.182575 -0.034408 0.047926 0.089130 0.221873 0.240195 0.058592 0.272586 0.168905 0.174271 0.105448
polarizability: 1.75316036e+02 7.48520030e+00 1.36796057e+02 7.03623825e+00 4.47591135e-01 7.88188582e+01
1716.lowfreq: -9.3013 -5.8256 -0.0004 0.0004 0.0005 7.0086 37.6233 47.4685 64.3967
frequency: 37.5173 47.4660 64.3901 89.5479 115.7392 141.9353 158.7914 184.2187 185.3036 243.8809 267.9994 278.4693 289.3155 296.4658 319.8498 333.3718 369.9622 383.6794 385.9901 417.3227 458.9340 476.7668 514.7159 540.9065 591.7810 622.7028 663.9630 672.5449 694.1132 709.2943 712.5751 735.5166 774.5053 776.9657 799.6509 866.8650 894.2320 933.1483 962.9103 974.0412 990.9132 1028.7552 1040.5144 1052.8640 1067.6639 1075.8979 1094.4341 1116.4878 1175.8246 1195.7974 1215.3242 1229.2321 1237.9782 1254.2508 1255.6084 1281.2385 1310.5456 1318.5902 1323.8105 1336.1574 1353.1049 1364.8375 1381.4768 1384.2140 1409.6148 1417.6871 1468.9386 1607.3877 1634.5735 1662.9918 2934.2768 2973.7783 2993.9734 2996.5687 3034.7289 3102.8857 3143.8087 3391.5695 3464.3641 3520.3980 3578.7534
redmass: 7.0274 7.0714 8.1390 7.5125 4.7965 8.5540 5.3947 5.4794 6.6575 6.6840 5.4786 1.4071 3.6537 4.3480 8.4028 6.4636 7.8015 5.9077 9.8671 3.9085 8.5795 1.6496 1.9822 5.0285 6.4780 4.7794 1.3449 3.1601 2.1600 5.2518 9.5814 7.2909 2.0986 5.2034 3.9373 3.3907 3.5075 1.3470 4.4992 2.0819 3.1257 3.7922 7.2316 3.9663 4.1690 2.5709 3.2365 7.3996 1.1540 1.1755 4.9903 1.2870 1.2152 2.0046 1.2333 1.2470 1.3607 1.6176 1.3052 1.2047 1.6709 1.8668 1.6613 1.5157 4.6196 1.4821 1.0779 5.7861 9.6895 6.7521 1.0581 1.0853 1.0969 1.0914 1.0867 1.0887 1.0955 1.0651 1.0648 1.0773 1.0668
irintensity: 0.9212 1.8936 4.6694 4.3778 7.3812 3.6264 9.0059 7.2854 4.8665 19.4292 7.2542 134.3945 20.0529 9.7262 6.5963 11.9753 1.3743 6.3223 11.7014 6.5679 27.5994 121.6835 50.7141 33.9074 13.8824 13.3238 102.7635 19.4558 6.1354 32.0135 3.6993 3.0715 130.8599 38.5545 28.0070 1.7931 2.2754 43.9696 50.1494 36.7309 73.6356 53.4899 118.0680 79.9027 84.3743 22.7840 34.0801 76.5642 3.0939 30.5499 31.2315 35.5754 153.1155 129.1568 10.6585 8.1044 29.1379 39.4423 24.0460 38.3415 8.9433 55.0001 21.9941 124.0470 58.1548 3.4059 6.7147 374.4322 43.2813 573.7898 45.9876 18.7795 73.1424 55.6634 10.6591 13.4281 69.6917 198.7741 42.3059 69.4231 10.3316
temp: 298.150 k
press: 1.00000 atm
elementType: 9 8 8 8 8 8 8 7 7 6 6 6 6 6 6 6 6 6 1 1 1 1 1 1 1 1 1 1 1
symmnumber: 1
zpe: 552729.6 jmol-1
zpe.correction: 0.210524 hartree
zpe.thermalcorrener: 0.226957 hartree
zpe.thermalcorrenthalpy: 0.227902 hartree
zpe.thermalcorrgfe: 0.166376 hartree
zpe.sumelectzpe: -1008.863948 hartree
zpe.sumelectthermal: -1008.847514 hartree
zpe.sumelectthermalent: -1008.846570 hartree
zpe.sumelectthermalfe: -1008.908096 hartree
dipole: -2.8642 0.9133 3.0683
dipole: 4.2957
quadrupole: -134.2986 -99.8212 -101.4511
quadrupole: -11.8592 -8.5559 9.5022
quadrupole: -22.4416 12.0358 10.4059 -11.8592 -8.5559 9.5022
hfenergy: -1009.0744714 hartree
pointgroup: C01 [X(C9H11F1N2O6)]
dipole: -1.1857629 -0.3021126 -1.1657356 debye
polarizability: 172.4395051|-12.8342523|139.2650746|-7.617187|-3.1874315|79.2263711 unknown
InChI: InChI=1S/C9H11FN2O6/c10-3-1-12(9(17)11-7(3)16)8-6(15)5(14)4(2-13)18-8/h1,4-6,8,11,13-15H,2H2
charge 0 multiplicity 1
29 atoms
F  2.833293 -2.610591 0.365641
O  -1.548457 -0.554184 1.189544
O  -1.886922 2.544792 -0.567917
O  -3.926333 1.173595 0.42332
O  -1.643912 -3.09506 0.085448
O  0.88574 2.508629 -0.241522
O  4.539793 -0.432695 -0.437144
N  0.546651 0.262669 0.339119
N  2.687318 1.003312 -0.306609
C  -1.671192 1.113485 -0.574349
C  -3.045136 0.399566 -0.433018
C  -0.882418 0.615162 0.680122
C  -2.678707 -0.918672 0.275776
C  -2.266476 -2.027981 -0.704668
C  1.350866 1.333915 -0.07849
C  1.036468 -1.034002 0.486712
C  2.353958 -1.308941 0.229057
C  3.316488 -0.284332 -0.188895
H  -1.152592 0.785703 -1.497875
H  -3.513617 0.22926 -1.424283
H  -0.853005 1.398029 1.460128
H  -3.485378 -1.263935 0.940062
H  -1.557096 -1.642775 -1.470225
H  -3.181299 -2.384031 -1.223959
H  -0.980729 2.964453 -0.491734
H  -3.671508 2.130286 0.301385
H  0.309624 -1.791097 0.80371
H  3.296505 1.771966 -0.607132
H  -1.532027 -3.904226 -0.473302
