program: Gaussian 09
title: 000095640
version: EM64L-G09RevD.01
frameworkgroup: C1[X(C10H14O)]
method: RPBEPBE
basis: SDD
operation: Freq
keyword: #pfreq=noraman
keyword: PBEPBE/SDD
title: #p freq=noraman PBEPBE/SDD
converged: YES YES NO NO
title: Mulliken charges:
elementType: O C C C C C C C C C C H H H H H H H H H H H H H H
charge: -0.435630 -0.097684 -0.556346 -0.347673 0.501693 -0.716924 -0.403579 -0.421733 -0.231134 -0.230433 -0.244248 0.215493 0.236763 0.200308 0.195165 0.213751 0.245054 0.212662 0.202825 0.228713 0.231584 0.222258 0.223203 0.329093 0.226817
chargesum: 0.00000
title: Mulliken charges with hydrogens summed into heavy atoms:
elementType: O C C C C C C C C C C
charge: -0.106537 0.117809 -0.119275 0.061244 0.501693 -0.056383 -0.174866 -0.190149 -0.008876 -0.007229 -0.017430
polarizability: 1.37811228e+02 -1.43511976e+00 1.06311515e+02 -7.53938262e+00 -1.26375895e+01 7.55826094e+01
1716.lowfreq: -0.0007 -0.0005 0.0001 2.0757 7.3491 15.7015 34.6419 57.8062 91.5580
frequency: 34.6110 57.7539 91.5520 125.6470 193.0216 216.5969 239.8108 297.5814 350.2692 363.1475 395.7528 404.5102 468.0772 497.5470 594.1959 617.9558 706.9701 745.5058 808.7821 835.5141 854.4374 889.7656 897.9385 919.7955 943.5005 975.5408 983.6290 989.8571 993.0523 1027.2238 1044.8249 1077.8146 1098.3365 1134.9815 1168.2317 1171.1756 1187.3188 1217.1182 1223.3070 1290.4172 1302.9773 1323.2949 1336.1643 1341.5990 1368.6525 1382.1036 1388.4532 1439.5832 1463.5758 1473.4122 1479.0667 1483.0761 1484.1817 1591.6274 1614.0400 2946.9781 2955.6041 2971.2077 2979.8388 3040.6191 3058.0213 3065.8714 3082.2695 3111.3004 3114.5473 3130.0157 3141.1957 3160.5341 3557.6197
redmass: 3.8095 3.6718 3.8153 2.6726 2.2471 1.4509 2.6039 1.3553 2.3568 2.0802 2.0189 2.8287 3.8148 2.9849 4.1165 6.2854 1.8223 1.9424 2.8843 2.5442 1.2498 1.4613 1.8087 1.4372 1.6205 1.3867 3.4316 5.9019 1.3333 2.1820 1.5614 1.4857 1.7779 1.7391 1.5700 1.0607 1.1195 2.3501 1.4359 1.2098 1.3902 1.3284 1.3145 1.3991 1.2801 5.6987 1.2433 2.1710 1.0815 1.0737 1.1901 1.0567 1.9292 6.0106 6.1618 1.0811 1.0676 1.0373 1.0598 1.1020 1.0981 1.0977 1.0987 1.0867 1.0867 1.0907 1.0958 1.1014 1.0661
irintensity: 0.7887 0.0591 0.8123 2.4514 4.7022 4.6013 1.9043 119.0670 16.6638 17.7012 42.4057 0.0091 8.2829 8.7465 6.1600 0.1324 48.3480 48.5580 3.5507 7.0299 0.0444 1.8937 26.5189 3.0866 3.8847 0.0447 92.4346 0.0161 1.7534 5.4920 11.5343 4.0975 4.5161 10.5308 10.9286 0.8022 0.4188 1.3743 10.5632 0.7831 7.7048 1.8239 4.7059 9.0129 8.2448 1.6743 25.4868 7.3050 1.9449 3.6693 17.3742 11.4450 13.7584 1.4408 10.9231 24.7650 63.1258 41.7490 26.7048 16.1924 4.7278 72.1412 31.7677 9.5507 7.6493 11.2039 48.2545 23.4430 6.2672
temp: 298.150 k
press: 1.00000 atm
elementType: 8 6 6 6 6 6 6 6 6 6 6 1 1 1 1 1 1 1 1 1 1 1 1 1 1
symmnumber: 1
zpe: 561769.3 jmol-1
zpe.correction: 0.213967 hartree
zpe.thermalcorrener: 0.225186 hartree
zpe.thermalcorrenthalpy: 0.226130 hartree
zpe.thermalcorrgfe: 0.176231 hartree
zpe.sumelectzpe: -463.838365 hartree
zpe.sumelectthermal: -463.827146 hartree
zpe.sumelectthermalent: -463.826202 hartree
zpe.sumelectthermalfe: -463.876101 hartree
dipole: -0.3375 0.6452 1.7617
dipole: 1.9063
quadrupole: -68.6826 -62.7528 -69.0178
quadrupole: 2.1648 4.5243 -6.4723
quadrupole: -1.8648 4.0649 -2.2001 2.1648 4.5243 -6.4723
hfenergy: -464.0523319 hartree
pointgroup: C01 [X(C10H14O1)]
dipole: -0.1203728 0.2858145 0.6828592 debye
dipolederiv: -0.7573426 0.1889271 -0.0650554 0.2412254 -0.7467651 -0.1642252 -0.0720899 -0.1206281 -0.1657321 -0.0385236 0.0683299 0.0295693 0.0468563 0.0599902 -0.0152853 0.18887 -0.0400062 0.1017851 -0.1525156 0.0061648 -0.0289658 0.042727 0.0773985 -0.054076 -0.1246297 -0.078848 0.0839231 0.4380805 -0.1318397 0.0053 -0.1541613 0.6015273 0.0483609 -0.0585994 0.0359091 0.2749483 0.4183361 0.0272051 -0.0489771 -0.0034453 -0.0410981 0.0035291 -0.1266284 -0.0039457 -0.0634738 -0.0406203 0.0679022 0.009864 0.0252604 -0.0372719 -0.0602951 -0.0287858 -0.082569 0.0650867 -0.1400152 -0.0718055 -0.0065042 -0.1424026 0.0049217 -0.0530572 0.0591214 -0.064237 -0.1370653 -0.1907335 0.0152808 -0.0350148 0.0816818 0.0179561 -0.1040025 -0.0449047 -0.0866013 -0.1043468 -0.0011692 0.0151882 -0.0444087 0.0426888 0.0621397 -0.1061743 -0.060228 -0.105251 -0.0843519 0.0348125 -0.0696986 -0.0109739 -0.0933072 0.0481349 -0.0763626 -0.0051949 -0.0805683 -0.1035103 0.0377633 -0.0098277 -0.0709575 -0.0103594 -0.1159116 -0.0294395 -0.0528209 -0.0283043 -0.1458368 0.0386434 -0.0209077 0.0392522 -0.0340882 -0.0719253 0.1149628 0.0273115 0.0996553 -0.077569 0.0741771 0.0004669 0.0405821 -0.0038904 -0.0696827 -0.0916859 0.0378347 -0.046473 0.0438549 0.0072026 -0.0171245 0.0159068 -0.0487629 -0.0296916 0.1466638 0.0427545 0.0838005 -0.0397174 -0.1331447 -0.0393995 -0.1009267 -0.0339768 -0.0439416 -0.0721 -0.1561967 -0.1080189 -0.0841146 0.0703036 0.0036751 0.0205747 -0.0191027 -0.0258787 0.0737837 0.0875412 0.0952662 -0.0689734 -0.0949032 0.0876264 0.0758388 0.0904103 0.0563054 -0.004939 0.0861268 0.0079769 0.0800069 -0.0206276 -0.0670249 -0.1438032 -0.037319 0.0543661 -0.0318234 -0.1453973 -0.0685516 -0.0793889 0.0734469 -0.0519027 0.0448224 -0.0378492 -0.0219338 0.0657995 0.0709813 0.1412383 -0.0637717 0.0063299 0.1230822 -0.0137708 0.1128262 -0.0168444 0.0503854 -0.0093214 0.0470866 0.1145484 0.0551251 -0.0739724 0.0705634 -0.0597884 -0.0286987 0.092838 0.0644493 0.0997814 0.0795409 0.0443056 -0.0567487 0.0520651 -0.0708638 -0.044927 0.1101817 0.063686 0.1106603 0.08783 -0.0045928 0.1024132 -0.0152651 0.1220697 -0.0317099 0.0648552 -0.0144858 0.065906 0.1261508 0.401635 -0.0980122 0.1084196 -0.0598604 0.2431528 0.0626348 0.0936563 0.0958909 0.0307802 -0.1259732 0.0020021 0.0718647 0.0034316 0.1003879 0.0294714 0.07695 0.0308309 0.1293968 unknown
polarizability: 137.5868071|-2.8249469|105.3740137|-8.2208215|-13.5897922|76.7445324 unknown
InChI: InChI=1S/C10H14O/c1-9(8-11)7-10-5-3-2-4-6-10/h2-6,9,11H,7-8H2,1H3
charge 0 multiplicity 1
25 atoms
O  3.579454 -1.416758 -0.319556
C  1.875835 0.302722 0.375691
C  0.929017 -0.025428 -0.819246
C  3.343564 0.00333 -0.002372
C  -0.543063 -0.050955 -0.438204
C  1.734544 1.767579 0.846784
C  -1.086955 -1.166636 0.253001
C  -1.405049 1.035166 -0.739229
C  -2.445936 -1.194534 0.636645
C  -2.766983 1.012925 -0.358889
C  -3.292556 -0.102093 0.332977
H  1.597642 -0.363114 1.222469
H  1.236474 -1.008656 -1.225201
H  1.103631 0.725497 -1.615471
H  4.021177 0.33946 0.812165
H  3.62075 0.537334 -0.928493
H  0.687297 1.996508 1.110684
H  2.362001 1.968654 1.735427
H  2.044057 2.468801 0.047289
H  -0.440474 -2.024364 0.479967
H  -1.005993 1.90147 -1.281774
H  -2.847426 -2.067356 1.164592
H  -3.416276 1.861203 -0.604687
H  3.400484 -1.954371 0.493232
H  -4.348115 -0.123182 0.626699
