program: Gaussian 09
title: 000095618
version: EM64L-G09RevD.01
frameworkgroup: C1[X(C10H15NO)]
method: RPBEPBE
basis: SDD
operation: Freq
keyword: #p
keyword: freq=noraman
keyword: PBEPBE/SDD
title: #p freq=noraman PBEPBE/SDD
converged: YES YES NO NO
title: Mulliken charges:
elementType: O N C C C C C C C C C C H H H H H H H H H H H H H H H
charge: -0.469816 -0.282957 -0.249987 -0.370603 0.428693 -0.323004 -0.443390 -0.387331 -0.688106 -0.219262 -0.225821 -0.240757 0.219616 0.219235 0.204221 0.272647 0.178371 0.204729 0.236639 0.265589 0.229737 0.205362 0.208716 0.345957 0.226591 0.226004 0.228926
chargesum: 0.00000
title: Mulliken charges with hydrogens summed into heavy atoms:
elementType: O N C C C C C C C C C C
charge: -0.123859 -0.010310 -0.030371 0.052853 0.428693 0.060096 -0.206751 -0.121741 -0.044290 0.007328 0.000183 -0.011831
polarizability: 1.57992385e+02 -7.36957033e+00 1.03222125e+02 -9.89839217e+00 -1.24534346e+01 8.98124098e+01
1716.lowfreq: -7.6809 -3.2205 -0.0005 -0.0002 0.0003 10.6067 33.1082 58.7969 63.0111
frequency: 33.0612 58.7709 62.9846 103.6128 142.2087 147.2082 219.1478 250.0302 253.4892 300.0068 326.7984 353.9369 404.1688 427.7268 509.5219 543.1724 615.6012 620.7968 705.3491 718.7598 770.9470 803.8874 809.8728 855.5725 879.1922 914.1524 922.3775 977.6933 989.2186 995.7714 1013.2506 1018.2581 1026.1075 1049.2140 1082.5409 1114.3793 1145.0846 1160.8361 1171.9679 1183.1154 1200.3289 1209.4627 1248.8226 1271.3328 1281.3774 1309.7341 1335.7345 1346.0044 1384.8838 1386.4695 1392.4088 1439.9284 1448.9330 1464.6511 1472.0921 1481.1379 1482.6501 1499.4537 1593.2297 1612.7582 2848.1426 2862.7215 2970.1083 2979.1904 2989.9615 3015.3426 3071.5813 3091.4733 3115.0957 3125.1160 3137.7910 3149.5628 3163.4583 3439.3226 3569.5731
redmass: 3.8806 2.8467 3.6669 1.8722 2.8219 3.7397 3.8535 3.7338 1.1923 1.8734 1.8809 2.7412 2.7960 3.0239 3.4199 2.8626 6.4171 5.3682 1.8134 1.3585 1.8441 3.1294 1.1226 1.2534 2.8422 1.6812 1.4304 1.3865 6.2656 1.3205 2.1699 2.6692 2.1245 2.4335 1.5638 1.8258 1.4924 3.3852 1.0570 1.1137 1.7475 1.7602 1.2084 1.1979 1.5033 1.2911 1.2927 1.3943 1.3869 5.7185 1.3827 2.1420 1.1782 1.0913 1.0643 2.1493 1.0836 1.0888 6.1077 6.1006 1.0720 1.0704 1.0843 1.0375 1.0856 1.0884 1.0984 1.1002 1.0870 1.0863 1.0915 1.0957 1.1014 1.0739 1.0662
irintensity: 0.8231 0.3743 0.1562 3.7314 1.0127 1.1353 3.2634 1.8737 1.3256 53.7157 71.7421 37.7020 0.8788 0.6834 4.6157 34.4205 0.4193 16.2766 65.0117 69.5140 61.1841 18.2146 4.8186 0.2860 17.2872 7.2815 5.1233 0.0567 0.2473 1.4155 30.7462 38.4795 7.2683 21.7334 9.2239 11.1827 10.8208 75.0918 0.3916 1.2264 4.9700 10.3079 12.3412 6.1303 39.7303 1.3851 2.4616 5.9005 4.2156 1.5694 23.1755 12.9487 47.7047 12.8072 19.7743 7.9963 3.8900 5.6433 0.5928 1.9644 90.0141 124.8960 42.2625 33.9151 36.5517 31.0903 56.9470 39.8787 7.4838 0.1730 20.2325 31.6227 20.9445 2.7264 6.7055
temp: 298.150 k
press: 1.00000 atm
elementType: 8 7 6 6 6 6 6 6 6 6 6 6 1 1 1 1 1 1 1 1 1 1 1 1 1 1 1
symmnumber: 1
zpe: 604530.6 jmol-1
zpe.correction: 0.230254 hartree
zpe.thermalcorrener: 0.242804 hartree
zpe.thermalcorrenthalpy: 0.243749 hartree
zpe.thermalcorrgfe: 0.190469 hartree
zpe.sumelectzpe: -519.097217 hartree
zpe.sumelectthermal: -519.084666 hartree
zpe.sumelectthermalent: -519.083722 hartree
zpe.sumelectthermalfe: -519.137001 hartree
dipole: 1.2860 -0.0604 0.0108
dipole: 1.2874
quadrupole: -68.3023 -70.8411 -71.1994
quadrupole: -0.8571 1.7779 -0.8013
quadrupole: 1.8119 -0.7268 -1.0851 -0.8571 1.7779 -0.8013
hfenergy: -519.3274708 hartree
pointgroup: C01 [X(C10H15N1O1)]
dipole: -0.5056425 -0.0266639 -0.0129107 debye
polarizability: 158.0901399|8.5898432|100.6039422|-8.3634677|13.6190836|92.3328377 unknown
InChI: InChI=1S/C10H15NO/c1-2-11-8-10(12)9-6-4-3-5-7-9/h3-7,10-12H,2,8H2,1H3
charge 0 multiplicity 1
27 atoms
O  0.713573 1.717865 -0.870691
N  2.769785 -0.076628 -0.147912
C  0.397113 0.275879 -0.7170
C  1.391009 -0.225173 0.345398
C  -1.055307 0.054097 -0.316536
C  3.816617 -0.518267 0.795921
C  -1.801012 -1.009243 -0.882605
C  -1.672795 0.895506 0.644798
C  5.218029 -0.307416 0.196784
C  -3.139517 -1.237846 -0.489669
C  -3.011244 0.670952 1.035495
C  -3.748147 -0.397642 0.471286
H  0.616923 -0.254469 -1.667789
H  1.18876 -1.295412 0.545246
H  1.190007 0.331289 1.296085
H  2.924105 0.887347 -0.476723
H  3.753233 0.005065 1.784687
H  3.661081 -1.59643 1.0025
H  -1.33312 -1.658907 -1.633362
H  -1.09958 1.727543 1.068646
H  5.314375 -0.858068 -0.755324
H  5.405626 0.764383 -0.006976
H  6.000997 -0.660346 0.892214
H  0.096925 2.111159 -1.538252
H  -3.707081 -2.062786 -0.934989
H  -3.481161 1.326292 1.777852
H  -4.787091 -0.570545 0.774014
