program: Gaussian 09
title: 000095658
version: EM64L-G09RevD.01
frameworkgroup: C1[X(C16H24O3)]
method: RPBEPBE
basis: SDD
operation: Freq
keyword: #pfreq=noraman
keyword: PBEPBE/SDD
title: #p freq=noraman PBEPBE/SDD
converged: YES YES NO NO
title: Mulliken charges:
elementType: O O O C C C C C C C C C C C C C C C C H H H H H H H H H H H H H H H H H H H H H H H H
charge: -0.275965 -0.227226 -0.265317 0.335969 -0.038966 -0.109621 -0.406821 -0.735749 -0.760181 -0.176226 -0.714355 -0.729961 0.521411 -0.490588 -0.310918 -0.353527 -0.357238 0.326248 -0.538462 0.182364 0.228776 0.187138 0.235318 0.202349 0.213215 0.250849 0.215232 0.211809 0.233863 0.197307 0.207756 0.216737 0.210118 0.193296 0.209049 0.263167 0.225425 0.251069 0.238521 0.248288 0.220868 0.220382 0.244596
chargesum: 0.00000
title: Mulliken charges with hydrogens summed into heavy atoms:
elementType: O O O C C C C C C C C C C C C C C C C
charge: -0.275965 -0.227226 -0.265317 0.335969 0.143398 0.119155 0.015634 -0.069335 -0.099277 0.021081 -0.079743 -0.064450 0.521411 -0.265162 -0.059849 -0.115006 -0.108950 0.326248 0.147384
polarizability: 2.56075033e+02 -1.22315714e+01 1.44226283e+02 -1.14447687e+00 -3.86753583e+00 1.58277128e+02
1716.lowfreq: -12.1382 -4.0825 -0.0004 0.0005 0.0006 7.6941 12.5411 41.3873 47.6778
frequency: 8.8578 41.2426 47.6667 68.3890 95.4884 110.5403 147.9775 161.5723 179.7152 197.5248 204.4724 207.4412 221.9061 229.3630 241.6920 249.7484 275.8471 285.0564 321.3075 328.4657 348.8057 360.0045 390.4755 412.3750 416.0085 442.5793 451.9662 477.2585 515.3652 523.0940 555.8986 606.2925 622.4211 641.0282 733.3456 757.1382 767.6246 807.6362 829.4190 837.4316 863.1177 872.4730 891.3931 911.5139 913.6714 926.0492 936.2305 940.2372 945.3996 957.8052 964.0919 981.1091 986.0814 988.6791 1004.8542 1023.5554 1035.9616 1111.5483 1111.6797 1116.9127 1141.9601 1156.0199 1172.6884 1176.7102 1181.3962 1204.8170 1212.1231 1215.1843 1229.6716 1258.9882 1270.3628 1297.8994 1307.5546 1312.5430 1323.2251 1341.7457 1355.4226 1356.6504 1375.3514 1377.0467 1394.0667 1399.2819 1402.4451 1419.3008 1436.0489 1447.8268 1462.3377 1465.9682 1466.8903 1468.3564 1473.7367 1474.9237 1479.0317 1487.3617 1491.2374 1501.4341 1508.6074 1589.6908 1628.5771 2879.1226 2887.4215 2917.1212 2958.5539 2971.5382 2972.0120 2977.7147 2982.7981 2996.4333 3045.9813 3050.7754 3059.8090 3065.3965 3068.8738 3071.4535 3082.0618 3094.8748 3106.0580 3108.0073 3120.8745 3124.2150 3153.2864 3163.8103 3174.6578
redmass: 3.4634 4.1021 3.5580 2.8569 3.4147 3.5570 3.5989 2.4378 1.3559 3.6208 1.9433 1.1643 1.1310 2.5978 1.3283 2.0073 2.0908 2.6078 2.0522 4.1133 2.6012 2.5946 3.4672 2.4348 2.9471 2.9794 3.1267 3.6484 3.6851 3.2413 3.1208 5.1825 6.2830 7.0365 3.7171 5.0804 3.1697 1.4125 1.6319 2.5911 2.8682 2.8622 3.3546 2.2423 2.3068 1.4087 1.4563 1.6051 3.3556 1.6812 1.3772 1.7316 1.7060 6.4938 2.5597 1.6555 3.9386 1.3329 1.2615 2.2732 2.2993 1.3257 2.2558 1.2767 1.8896 1.5990 2.2823 1.6912 3.7094 1.2383 1.6037 1.3615 1.3554 1.4051 1.2620 1.4269 1.4949 1.8788 1.2185 1.2104 1.2381 2.1047 1.4404 3.3612 1.1731 1.0888 1.0528 1.0541 1.0505 1.0510 1.0684 1.0503 1.0546 1.0523 1.0543 1.0505 2.7681 7.0817 6.5308 1.0834 1.0812 1.0683 1.0329 1.0387 1.0387 1.0376 1.0365 1.0824 1.1039 1.0983 1.0983 1.0958 1.0981 1.0974 1.0994 1.0988 1.0980 1.0946 1.0899 1.0990 1.0879 1.0935 1.0975
irintensity: 0.7217 0.5092 0.5585 0.2837 3.8186 1.0395 2.9439 0.2345 0.0634 2.0956 3.0897 0.5402 0.0184 2.6433 0.1576 3.4443 3.4263 0.1292 1.3591 6.1195 0.0491 0.2755 1.4081 0.6786 0.1429 1.4106 1.0000 0.8799 5.0463 2.5709 15.3381 18.3286 14.2181 1.5316 0.3041 1.7146 3.7958 57.4982 75.4936 12.4290 12.3726 3.5263 18.0610 60.1024 13.1889 17.4082 7.0301 9.6142 17.0308 17.7378 1.0479 44.8462 29.8654 37.2170 18.5603 25.9430 255.1273 11.6600 0.4212 0.8560 5.2650 3.2588 22.7331 56.6151 8.9604 0.7480 1.9201 7.1732 188.7737 14.4011 11.5490 22.6762 1.2107 1.5849 8.4157 19.8516 3.1743 39.2609 10.0176 28.7129 15.6838 90.6025 0.2953 1.8136 4.9349 8.2004 9.1859 4.7016 13.3050 2.1867 44.9162 6.6146 7.5283 15.9507 12.1201 24.9508 62.9681 12.5887 97.1172 23.5753 56.6244 92.4165 73.0362 29.4790 32.6031 49.5861 28.9309 21.4971 49.3478 24.7148 9.7142 13.3800 75.2035 73.8022 38.3102 17.3693 21.9134 31.9176 22.9790 18.0881 6.6630 17.6562 4.6179
temp: 298.150 k
press: 1.00000 atm
elementType: 8 8 8 6 6 6 6 6 6 6 6 6 6 6 6 6 6 6 6 1 1 1 1 1 1 1 1 1 1 1 1 1 1 1 1 1 1 1 1 1 1 1 1
symmnumber: 1
zpe: 962396.6 jmol-1
zpe.correction: 0.366557 hartree
zpe.thermalcorrener: 0.386656 hartree
zpe.thermalcorrenthalpy: 0.387600 hartree
zpe.thermalcorrgfe: 0.317438 hartree
zpe.sumelectzpe: -848.263665 hartree
zpe.sumelectthermal: -848.243566 hartree
zpe.sumelectthermalent: -848.242622 hartree
zpe.sumelectthermalfe: -848.312785 hartree
dipole: 0.7949 0.5181 -2.3981
dipole: 2.5790
quadrupole: -92.5050 -120.5122 -110.3120
quadrupole: -5.9817 7.5193 -0.7743
quadrupole: 15.2714 -12.7359 -2.5356 -5.9817 7.5193 -0.7743
hfenergy: -848.6302223 hartree
pointgroup: C01 [X(C16H24O3)]
dipole: 0.3237221 -0.1843382 0.9438012 debye
polarizability: 255.7861007|13.5082918|144.399223|0.0716744|-3.7447892|158.393121 unknown
InChI: InChI=1S/C16H24O3/c1-11(2)14-16(3,4)10-18-15(19-14)12-6-8-13(17-5)9-7-12/h6-9,11,14-15H,10H2,1-5H3
charge 0 multiplicity 1
43 atoms
O  1.042373 -0.514776 0.014763
O  0.621523 1.832344 0.25172
O  -5.26198 -0.32908 -0.732414
C  3.004359 1.022415 -0.099223
C  2.501198 -0.405152 0.325929
C  3.103444 -1.66764 -0.346798
C  2.040244 2.052304 0.572173
C  2.972609 1.200522 -1.634675
C  4.40678 1.357744 0.477173
C  0.232423 0.490754 0.701548
C  4.646684 -1.760883 -0.280542
C  2.479426 -2.93643 0.288489
C  -1.215864 0.263866 0.363904
C  -2.159813 -0.023517 1.37057
C  -1.649524 0.343289 -0.985638
C  -3.523457 -0.230923 1.057454
C  -2.998605 0.140381 -1.315511
C  -3.940731 -0.147093 -0.293257
C  -6.277572 -0.618792 0.282062
H  2.626332 -0.488843 1.434731
H  2.796083 -1.634862 -1.411063
H  2.174597 2.016567 1.678754
H  2.263647 3.072759 0.217204
H  3.259979 2.232671 -1.910602
H  3.674758 0.510883 -2.136909
H  1.957615 1.010142 -2.023278
H  4.582839 2.450015 0.424072
H  4.494662 1.056335 1.53899
H  5.219488 0.869437 -0.08159
H  0.427782 0.418155 1.800138
H  5.016987 -1.623469 0.753229
H  4.96752 -2.763708 -0.617858
H  5.146826 -1.020693 -0.927626
H  2.806791 -3.04791 1.341382
H  2.801034 -3.840726 -0.260343
H  1.379144 -2.884485 0.269353
H  -1.836711 -0.086118 2.417101
H  -0.9188 0.568977 -1.767958
H  -4.234391 -0.450499 1.859144
H  -3.352008 0.199647 -2.349364
H  -6.362677 0.207705 1.014488
H  -6.057832 -1.56491 0.814323
H  -7.220384 -0.718098 -0.275647
