program: Gaussian 09
title: 000095624
version: EM64L-G09RevD.01
frameworkgroup: C1[X(C12H10N2O2)]
method: RPBEPBE
basis: SDD
operation: Freq
keyword: #p
keyword: freq=noraman
keyword: PBEPBE/SDD
title: #p freq=noraman PBEPBE/SDD
converged: YES YES NO NO
title: Mulliken charges:
elementType: O O N N C C C C C C C C C C C C H H H H H H H H H H
charge: -0.437108 -0.170818 -0.088570 -0.059196 -0.246552 0.128797 0.150787 0.046221 -0.302843 -0.260042 -0.181678 -0.354392 -0.179072 -0.188105 -0.157024 -0.366895 0.279304 0.276733 0.284387 0.239817 0.371530 0.247358 0.233360 0.248585 0.238126 0.247290
chargesum: 0.00000
title: Mulliken charges with hydrogens summed into heavy atoms:
elementType: O O N N C C C C C C C C C C C C
charge: -0.065578 -0.170818 -0.088570 -0.059196 0.032751 0.128797 0.150787 0.046221 -0.026110 0.024345 0.058138 -0.107034 0.054288 0.060480 0.081102 -0.119604
polarizability: 1.93395362e+02 -1.13825741e+01 1.42034696e+02 7.27813123e+00 -1.34041648e+01 9.62333779e+01
1716.lowfreq: -7.2681 -0.0007 -0.0007 -0.0005 3.3727 7.9802 28.9317 45.4773 57.1296
frequency: 28.7652 45.4700 57.1260 91.3912 141.3999 154.6459 207.8932 217.4154 286.8858 302.5522 389.2687 405.2543 410.3196 427.9142 458.3371 509.0773 545.7385 606.5696 614.0505 625.4593 683.2106 698.1970 749.8171 752.3113 764.5131 791.8544 830.2284 863.9257 911.6860 918.6960 957.9007 965.5227 967.0240 969.8818 974.3014 1006.5310 1016.5263 1030.5749 1037.3497 1042.0444 1085.1785 1089.9651 1161.2068 1163.0644 1197.1912 1213.6285 1232.5940 1282.0865 1290.2581 1299.5106 1324.3257 1333.8864 1395.9742 1413.8034 1421.8974 1445.5573 1449.4596 1559.3018 1564.8049 1570.8816 1582.2425 1615.3404 3067.6166 3133.6607 3135.8061 3143.6683 3147.5812 3161.0383 3166.6130 3174.4024 3177.5548 3342.9910
redmass: 5.5990 4.4732 4.9518 7.0467 5.8075 6.1673 4.7591 5.2253 6.2999 7.1448 3.5005 3.2888 4.4182 4.1947 5.9447 3.7928 1.2373 6.2954 6.7533 6.1897 5.5738 4.9364 1.9732 5.0237 1.3231 2.1938 4.5765 3.8817 1.3259 1.3218 5.3863 1.5163 6.4853 6.3585 1.4828 1.3302 1.3531 3.3996 2.2183 2.6538 1.6146 1.6358 1.0839 1.0845 1.8355 2.0814 2.4798 1.6035 1.5462 1.7525 6.8930 4.1988 1.2758 1.9897 1.8408 2.1580 2.1131 5.9605 6.1285 5.7234 5.7284 10.1700 1.0852 1.0887 1.0871 1.0906 1.0901 1.0950 1.0947 1.1015 1.1009 1.0639
irintensity: 1.7225 1.9552 1.6774 2.6958 2.7486 0.6774 8.1898 2.4024 0.5411 8.3475 1.2862 0.3660 8.4037 3.4123 2.9268 14.3134 125.7980 39.1941 1.6908 13.4371 11.9905 6.4859 29.3480 2.3721 62.0787 60.4790 12.0288 1.2291 0.0628 0.3971 69.1164 2.2356 15.8216 14.6433 1.0011 1.7151 0.2806 64.5102 3.2930 39.5129 10.8554 0.7488 3.2557 1.1740 19.6562 27.2219 89.1859 0.2595 50.7760 48.8101 6.1956 5.3210 104.4729 18.7140 35.0796 5.1273 56.3279 17.7872 14.0744 15.9819 44.5264 76.0537 3.3248 9.1220 4.9397 14.2324 11.2134 8.2070 8.9777 27.9022 19.4459 92.5776
temp: 298.150 k
press: 1.00000 atm
elementType: 8 8 7 7 6 6 6 6 6 6 6 6 6 6 6 6 1 1 1 1 1 1 1 1 1 1
symmnumber: 1
zpe: 513202.3 jmol-1
zpe.correction: 0.195468 hartree
zpe.thermalcorrener: 0.208601 hartree
zpe.thermalcorrenthalpy: 0.209545 hartree
zpe.thermalcorrgfe: 0.154126 hartree
zpe.sumelectzpe: -722.081223 hartree
zpe.sumelectthermal: -722.068091 hartree
zpe.sumelectthermalent: -722.067147 hartree
zpe.sumelectthermalfe: -722.122566 hartree
dipole: 2.5052 -5.9842 -1.4071
dipole: 6.6383
quadrupole: -64.3063 -95.4710 -95.8115
quadrupole: 1.9080 2.1777 -2.7361
quadrupole: 20.8899 -10.2747 -10.6152 1.9080 2.1777 -2.7361
hfenergy: -722.2766914 hartree
pointgroup: C01 [X(C12H10N2O2)]
dipole: -0.7684223 -2.4961002 0.0058464 debye
dipolederiv: -0.6393638 -0.0449497 0.0974192 -0.1448754 -0.7364306 0.0708889 0.0697928 0.0568529 -0.3582 -0.662452 -0.0614403 0.0435077 -0.1087594 -0.5289103 -0.2003366 0.2085456 -0.348018 -0.5811457 -0.5960309 0.1237223 -0.1014225 -0.0404411 -0.3402838 0.013132 -0.168231 0.0342361 -0.2378608 -0.348752 -0.0382987 -0.0107188 0.0307618 -0.215936 -0.0639593 0.088173 0.0116406 -0.282661 -0.308368 0.2974366 -0.0123345 0.3862698 0.4082821 -0.0778306 0.007998 -0.031879 0.1548212 0.5705668 -0.1904338 0.1258558 -0.5708178 0.1730934 -0.0629807 0.3626106 -0.0359691 0.0210407 1.42363 0.2513273 -0.0730411 0.5259715 0.4640837 0.2883293 -0.4403695 0.4542882 0.5052633 -0.1979129 -0.1203366 0.0213105 -0.2545001 -0.0471439 -0.016711 -0.0216354 -0.0826448 0.0102607 -0.1884657 0.0960151 0.0065721 0.3812926 -0.2374341 0.085165 0.002937 0.0310015 -0.0848722 -0.2454333 -0.063144 0.0095742 -0.1197796 -0.0523608 0.0544357 -0.0321058 0.0469048 0.0054571 0.16031 -0.039107 0.1035277 -0.0511757 0.1885922 0.0494908 0.1425793 0.0277859 -0.0397648 0.2473055 -0.0184316 0.165307 0.2679009 0.1799371 0.1376699 0.1794989 0.0402793 0.0547429 -0.1506054 -0.0514422 0.0279215 -0.2392984 -0.1357402 -0.1076009 -0.0610373 -0.0339946 -0.1303379 0.1704263 0.0567606 -0.1330957 0.0869207 -0.0522208 0.0417134 -0.1020755 0.0529566 0.0259565 0.0218285 0.1592766 0.1210872 0.0222552 -0.0410764 0.0101398 -0.0419115 -0.0523181 -0.1557536 -0.1084899 -0.0947559 -0.1560263 0.0667979 0.0677351 0.1722486 0.0784634 0.2443691 0.2484443 0.1169648 -0.0130917 -0.0317055 0.0299145 0.0398085 -0.0326913 -0.0552518 -0.0429676 0.0000538 0.1177366 -0.0582539 -0.0719957 -0.0905655 0.0759759 -0.0252587 -0.0731898 -0.0327217 0.0990545 0.1570002 -0.0167795 0.0017591 0.0189405 0.1004671 -0.0754855 0.0263282 -0.062889 0.0557171 0.097944 0.007196 -0.0242239 0.0291009 -0.0952874 -0.0338754 -0.0122957 -0.0405483 0.1265651 0.3809761 -0.0930397 -0.0174793 -0.0777388 0.4791781 -0.0231157 -0.0289187 -0.0474029 0.2247758 -0.036601 -0.0391293 -0.0953434 -0.0664904 0.053715 -0.0503414 -0.1168866 -0.028111 0.0725799 -0.0235732 0.0859829 -0.0855845 0.1003842 0.0419243 0.0352084 -0.0830566 0.0236649 0.1218803 -0.042822 -0.0278009 0.0899317 -0.0300407 0.1214659 -0.0168828 0.1020274 -0.0130942 0.0606566 -0.0044346 -0.1065165 -0.0306683 -0.1144193 0.0536938 -0.0625621 -0.0214026 -0.0544328 0.1077197 0.0886158 -0.0007665 0.0298657 -0.0376081 0.0348721 -0.1087897 -0.0105868 -0.116989 -0.0243936 unknown
polarizability: 188.901947|12.5871516|137.3268359|15.8263834|23.28092|105.4346527 unknown
InChI: InChI=1S/C12H10N2O2/c15-11(9-5-1-3-7-13-9)12(16)10-6-2-4-8-14-10/h1-8,11,15H
charge 0 multiplicity 1
26 atoms
O  1.112486 2.579558 -0.688569
O  -0.6348 1.830209 1.384291
N  2.717284 0.875623 0.499404
N  -1.584166 -0.605403 -1.110786
C  0.607543 1.229431 -0.651054
C  1.704842 0.261664 -0.181444
C  -0.593846 1.132898 0.338533
C  -1.723786 0.188501 -0.000146
C  1.678896 -1.132492 -0.416441
C  -2.879279 0.162857 0.821787
C  2.747211 -1.915621 0.072183
C  3.739687 0.111262 0.974835
C  3.796291 -1.28729 0.78538
C  -3.935482 -0.707343 0.482393
C  -3.802412 -1.52618 -0.663617
C  -2.610823 -1.444562 -1.423076
H  0.259223 0.946732 -1.657313
H  0.841601 -1.568476 -0.969848
H  -2.915861 0.821725 1.694272
H  2.765139 -2.99681 -0.101725
H  1.863033 2.598947 -0.021052
H  4.529215 0.643236 1.516608
H  4.639323 -1.861867 1.181013
H  -4.842936 -0.747455 1.093594
H  -4.599113 -2.212496 -0.966981
H  -2.471071 -2.066147 -2.314642
