program: Gaussian 09
title: 000095595
version: EM64L-G09RevD.01
frameworkgroup: C1[X(C12H14O)]
method: RPBEPBE
basis: SDD
operation: Freq
keyword: #pfreq=noraman
keyword: PBEPBE/SDD
title: #p freq=noraman PBEPBE/SDD
converged: YES YES NO NO
title: Mulliken charges:
elementType: O C C C C C C C C C C C C H H H H H H H H H H H H H H
charge: -0.214933 -0.237882 0.552562 -0.689137 -0.688750 -0.397653 -0.467739 0.493951 -0.396826 -0.389160 -0.292524 -0.233991 -0.127610 0.211549 0.211783 0.216783 0.229081 0.228972 0.216704 0.212409 0.234695 0.238147 0.230103 0.230683 0.221403 0.251758 0.155622
chargesum: 0.00000
title: Mulliken charges with hydrogens summed into heavy atoms:
elementType: O C C C C C C C C C C C C
charge: -0.214933 -0.026333 0.552562 -0.031490 -0.030665 -0.162958 -0.229592 0.493951 -0.166723 -0.158478 -0.071121 0.017767 0.028012
polarizability: 2.70158563e+02 1.26280764e+01 1.23835355e+02 -7.17506147e-02 -1.90155240e-01 7.26917236e+01
1716.lowfreq: -5.6119 -0.0007 -0.0005 -0.0003 3.4168 5.3678 38.0423 43.9236 82.6233
frequency: 37.8711 43.8888 82.6207 104.8150 132.5646 183.8066 193.0322 214.3537 242.3301 254.1458 298.4996 311.5785 354.9760 401.1848 436.7148 474.1694 553.9862 557.7600 571.6909 637.1751 722.5559 750.5218 833.1140 842.9635 845.4479 882.0825 889.4492 918.2620 955.5650 962.1915 969.9853 980.0214 1005.5892 1009.3167 1050.3891 1110.2468 1110.8323 1142.6420 1156.8665 1193.6061 1218.8313 1230.2159 1262.8640 1290.7620 1298.5040 1304.9516 1339.3664 1375.5250 1378.9742 1392.5215 1398.5364 1421.6297 1466.2636 1468.2510 1480.0339 1484.0565 1505.1464 1566.3235 1591.7768 1617.3500 1633.1666 2853.2384 2977.0559 2979.4738 2982.7520 3069.4646 3070.7706 3077.6331 3080.0244 3084.0407 3115.9856 3125.6986 3138.4647 3140.1602 3152.8982
redmass: 2.7500 4.8083 5.8556 2.7353 2.5011 2.9938 2.8638 1.1595 1.2244 3.3064 3.2006 3.7840 3.2503 2.8700 3.1989 3.2843 2.2582 3.3715 3.9605 6.7413 3.5804 3.0676 1.4364 4.9875 1.3310 1.7415 2.5927 1.1771 1.4532 1.4298 1.6064 1.3828 1.2302 2.9359 1.5396 2.5558 1.7985 2.8670 1.7240 1.1447 1.4898 1.7451 2.1984 1.5720 1.7558 1.3226 1.4125 1.3917 1.1899 2.4353 1.2936 2.9150 1.0453 1.0500 1.0482 1.1153 2.3061 6.2885 6.7376 6.1921 5.2171 1.0844 1.0349 1.0353 1.0843 1.0888 1.1000 1.0992 1.1006 1.0999 1.0873 1.0871 1.0934 1.0949 1.0958
irintensity: 1.0416 0.6725 3.2164 5.5529 0.0259 2.8061 3.7783 0.3704 0.8445 0.3865 3.1843 4.9631 0.5924 0.0467 0.7238 1.4346 21.7268 1.3305 19.3846 0.8580 1.6261 3.0218 41.4949 0.8673 10.8587 2.1170 2.8557 2.9992 0.1518 12.1986 0.5609 0.0477 51.4578 6.2758 56.9521 2.6169 44.9963 159.5387 1.9980 8.2949 1.3334 2.7447 10.9308 15.1912 6.1760 0.5994 10.3280 35.2152 15.2997 2.1432 6.1649 11.3107 0.4030 6.0409 18.0430 8.9764 11.4585 1.4287 352.8282 100.1575 217.9939 141.2498 30.2443 37.3912 20.4206 18.4247 1.2028 101.7462 23.8296 39.3954 11.8062 15.9847 6.0178 28.4493 9.8163
temp: 298.150 k
press: 1.00000 atm
elementType: 8 6 6 6 6 6 6 6 6 6 6 6 6 1 1 1 1 1 1 1 1 1 1 1 1 1 1
symmnumber: 1
zpe: 586119.5 jmol-1
zpe.correction: 0.223241 hartree
zpe.thermalcorrener: 0.236430 hartree
zpe.thermalcorrenthalpy: 0.237374 hartree
zpe.thermalcorrgfe: 0.182759 hartree
zpe.sumelectzpe: -539.930583 hartree
zpe.sumelectthermal: -539.917395 hartree
zpe.sumelectthermalent: -539.916451 hartree
zpe.sumelectthermalfe: -539.971066 hartree
dipole: 5.9637 1.9281 -0.0103
dipole: 6.2677
quadrupole: -103.9082 -71.2529 -81.8777
quadrupole: -10.8018 0.0460 -0.0494
quadrupole: -18.2286 14.4267 3.8019 -10.8018 0.0460 -0.0494
hfenergy: -540.1538246 hartree
pointgroup: C01 [X(C12H14O1)]
dipole: 2.35667 -0.7181552 0.1048603 debye
polarizability: 270.4147971|-10.1335013|123.1617208|4.8341046|-4.1183523|73.1091241 unknown
InChI: InChI=1S/C12H14O/c1-10(2)12-7-5-11(6-8-12)4-3-9-13/h3-10H,1-2H3
charge 0 multiplicity 1
27 atoms
O  -5.60812 0.797146 -0.193275
C  3.580695 -0.026772 0.062108
C  2.058229 -0.168608 0.040858
C  4.058469 0.804528 1.28354
C  4.11318 0.582064 -1.263377
C  1.213669 0.972877 -0.067308
C  1.442583 -1.442842 0.127827
C  -0.805223 -0.434729 0.000039
C  -0.184659 0.847652 -0.087624
C  0.040025 -1.575512 0.108203
C  -2.257547 -0.624778 -0.015576
C  -3.232818 0.339654 -0.109434
C  -4.65248 -0.027938 -0.108888
H  4.010014 -1.044075 0.160737
H  3.679046 1.841999 1.23333
H  5.162749 0.851116 1.309392
H  3.707717 0.361137 2.232561
H  3.809795 -0.025761 -2.134466
H  5.217238 0.637363 -1.246078
H  3.726602 1.606994 -1.414403
H  1.661481 1.971215 -0.135764
H  2.071141 -2.337564 0.211289
H  -0.803971 1.747263 -0.172356
H  -0.413601 -2.572209 0.177268
H  -2.597939 -1.670797 0.058914
H  -3.003605 1.409187 -0.18669
H  -4.853168 -1.12851 -0.02633
