program: Gaussian 09
title: 000095578
version: EM64L-G09RevD.01
frameworkgroup: C1[X(C7H13BrO2)]
method: RPBEPBE
basis: SDD
operation: Freq
keyword: #p
keyword: freq=noraman
keyword: PBEPBE/SDD
title: #p freq=noraman PBEPBE/SDD
converged: YES YES NO NO
title: Mulliken charges:
elementType: Br O O C C C C C C C H H H H H H H H H H H H H
charge: -0.010808 -0.252471 -0.215081 -0.319838 -0.355625 -0.352620 -0.568128 -0.694447 0.310656 -0.501125 0.213524 0.185754 0.258900 0.212050 0.203008 0.193499 0.319494 0.218266 0.209798 0.214450 0.244099 0.248707 0.237937
chargesum: 0.00000
title: Mulliken charges with hydrogens summed into heavy atoms:
elementType: Br O O C C C C C C C
charge: -0.010808 -0.252471 -0.215081 0.079440 0.115325 0.043886 -0.248634 -0.051933 0.310656 0.229618
polarizability: 1.14733209e+02 -2.74130054e+00 1.03200016e+02 -2.90868645e+00 5.67823649e-01 7.69988256e+01
1716.lowfreq: -6.5458 -0.0006 -0.0005 -0.0002 0.9559 9.0953 36.6729 54.7443 64.3780
frequency: 36.6147 54.6344 64.3741 77.2191 88.0713 110.3231 128.8084 199.0334 205.6395 222.6430 240.2546 254.8093 314.4384 400.0890 467.3296 532.5351 673.1799 704.3883 734.0299 793.0095 837.6325 899.9980 918.6935 953.4632 1010.8089 1051.3125 1074.6559 1106.3634 1112.1518 1116.1900 1125.3105 1150.2199 1186.6140 1229.0947 1244.9674 1281.6098 1291.8007 1304.3384 1349.6616 1364.8097 1390.5130 1421.0705 1443.2409 1452.8065 1461.8328 1467.6944 1476.0804 1477.8598 1487.5355 1640.1343 2959.7423 2963.5222 2971.3147 2974.6419 3006.4206 3009.5753 3035.4696 3057.6393 3071.8829 3074.6832 3093.3289 3109.3562 3154.8232
redmass: 4.6993 2.0002 2.7368 3.1395 1.2200 4.1876 2.4270 4.0507 3.8152 1.6382 1.6889 5.4911 4.0249 3.1068 4.7177 3.6351 5.1598 4.1887 1.1606 1.2776 5.3195 2.0871 1.2870 4.5797 3.3910 1.6354 2.3545 1.7708 1.4332 1.9459 2.5990 1.4668 1.5776 1.3401 1.3928 1.2091 1.0565 1.3848 1.5360 1.6659 1.2183 1.1851 1.0778 1.0498 1.0506 1.0690 1.0644 1.0436 1.0828 9.4564 1.0668 1.0602 1.0623 1.0363 1.0295 1.0971 1.0971 1.0968 1.1007 1.0994 1.0877 1.1048 1.1049
irintensity: 2.0506 0.3522 0.2604 0.6573 0.2207 0.4513 0.1576 6.3506 2.3288 0.9293 2.4002 5.2211 11.8025 3.3158 21.3802 10.8790 10.3192 6.4757 10.7066 3.3885 11.3416 3.6997 14.9453 16.3973 26.2212 3.5671 16.3181 5.2074 7.6316 13.9542 182.9442 23.4491 14.6661 13.5168 66.5138 9.4137 0.8204 28.0094 2.7895 5.4565 11.0490 16.4334 5.7286 16.3552 11.6987 0.8004 3.7170 12.6536 18.1415 172.1536 7.3820 3.6248 63.7851 36.4661 27.8786 5.2051 15.0052 9.2098 83.6751 49.8667 8.8160 23.3369 14.2781
temp: 298.150 k
press: 1.00000 atm
elementType: 35 8 8 6 6 6 6 6 6 6 1 1 1 1 1 1 1 1 1 1 1 1 1
symmnumber: 1
zpe: 497121.9 jmol-1
zpe.correction: 0.189344 hartree
zpe.thermalcorrener: 0.202380 hartree
zpe.thermalcorrenthalpy: 0.203324 hartree
zpe.thermalcorrgfe: 0.147336 hartree
zpe.sumelectzpe: -437.634336 hartree
zpe.sumelectthermal: -437.621299 hartree
zpe.sumelectthermalent: -437.620355 hartree
zpe.sumelectthermalfe: -437.676343 hartree
dipole: 0.1614 -1.7195 -1.7154
dipole: 2.4342
quadrupole: -58.7452 -71.4357 -74.8117
quadrupole: -2.3580 -3.1524 3.9625
quadrupole: 9.5856 -3.1048 -6.4808 -2.3580 -3.1524 3.9625
hfenergy: -437.8236795 hartree
pointgroup: C01 [X(C7H13Br1O2)]
dipole: 0.031136 -0.8802359 -0.3759923 debye
dipolederiv: -0.2258248 -0.0014813 -0.0051733 -0.0414761 -0.5172243 0.1558899 0.0018114 0.0978959 -0.161864 -1.2154848 0.3824119 0.2636965 0.3464643 -0.409386 -0.1024499 0.3929205 -0.1657626 -0.6502604 -0.6036875 0.1420632 -0.1538111 0.1043666 -0.322629 0.0367458 0.1941985 0.0124469 -0.8893681 -0.038919 0.0165056 0.0103502 -0.0359763 0.1342654 0.0634255 0.0766182 0.0796002 0.096318 -0.0450691 0.0129549 0.0114159 -0.1102714 -0.0995815 0.1060019 0.0454493 0.0928134 0.0030797 0.0444525 -0.0007381 -0.0148211 0.0249899 0.1727029 0.0192775 -0.0623202 0.0105733 0.1148932 0.0117323 0.2470745 -0.1102356 0.2620213 0.7426789 -0.1501586 -0.1623308 -0.1093811 0.1043597 -0.0757389 0.0071249 -0.0276821 -0.0063108 0.0825013 0.016874 0.0072691 0.0214772 0.0623062 1.2324477 -0.6356892 -0.0760362 -0.5117839 0.3098456 0.0527276 -0.506332 0.0744923 1.2586197 0.6070462 -0.128717 -0.0449573 -0.1002452 0.3247237 0.0092968 0.0465129 -0.0189796 0.2118342 0.0691176 0.0133864 -0.0000616 0.0331899 -0.1199445 0.0590529 -0.0145999 0.0327111 0.0560786 0.0330064 0.0024705 0.0073938 -0.0008174 0.0160169 -0.1122783 -0.0103608 -0.0901143 -0.144368 0.0653238 -0.0250441 -0.0040135 0.0081198 0.0744289 -0.0876805 -0.0245093 -0.0691488 -0.041892 0.0410206 -0.0563424 0.0317983 0.0521107 -0.1118539 0.0448238 0.0147664 0.0659677 0.0671491 0.0287667 -0.0193982 -0.0395169 -0.0139093 0.0199689 -0.1166065 -0.0100671 -0.0855386 -0.1439811 0.0198096 0.0552966 -0.0146949 0.0196076 -0.1775014 0.0846962 0.0060241 0.0539687 0.0506956 0.0699303 -0.0118429 -0.0072039 -0.0281876 -0.06624 -0.0418281 0.0118379 -0.0061608 -0.0192645 -0.1500421 -0.0544258 0.1000999 -0.0656576 0.0788176 0.0461809 0.1321978 0.0465688 0.0031346 0.073931 0.0162668 0.0000218 -0.009246 0.0209301 -0.1210848 -0.0652449 -0.1107322 -0.1204056 0.0764692 -0.0049448 -0.0128598 0.0591326 -0.1624973 0.0604532 -0.0369667 0.0475377 0.0742014 -0.0009452 -0.0161234 0.035333 0.0292996 -0.0437671 0.0802421 -0.0526668 0.1273492 0.03875 -0.0193424 0.0126744 -0.0129139 -0.0583297 -0.0519694 -0.0723469 -0.0955658 -0.0590272 0.0643565 0.0019997 0.0465174 0.0638716 0.042909 0.1057143 -0.0312548 0.1113582 -0.0485572 -0.034373 unknown
polarizability: 114.3647049|-4.271024|100.0843202|-3.3885101|-8.4334261|80.4830257 unknown
InChI: InChI=1S/C7H13BrO2/c1-3-4-5-6(8)7(9)10-2/h6H,3-5H2,1-2H3
charge 0 multiplicity 1
23 atoms
Br 0.527287 2.015611 -0.787493
O  2.634997 -0.753713 -0.779188
O  1.92458 -0.453862 1.423356
C  -2.197183 -0.052964 -0.281966
C  -0.842185 -0.344447 0.395171
C  -3.394755 -0.478241 0.598512
C  0.381493 -0.013975 -0.461293
C  -4.755638 -0.199366 -0.074813
C  1.69885 -0.410286 0.193915
C  3.983369 -1.113549 -0.272541
H  -2.272815 1.028191 -0.508595
H  -2.250042 -0.585198 -1.254832
H  -0.760779 0.181085 1.363921
H  -0.779123 -1.430192 0.627687
H  -3.342722 0.058417 1.567332
H  -3.312992 -1.558825 0.835724
H  0.324014 -0.418505 -1.483657
H  -5.596745 -0.506709 0.573048
H  -4.845949 -0.74968 -1.030322
H  -4.875184 0.877913 -0.295777
H  3.916698 -1.982363 0.403518
H  4.419729 -0.259904 0.272473
H  4.565995 -1.351038 -1.17288
