program: Gaussian 09
title: 000095560
version: EM64L-G09RevD.01
frameworkgroup: C1[X(C9H16O)]
method: RPBEPBE
basis: SDD
operation: Freq
keyword: #pfreq=noraman
keyword: PBEPBE/SDD
title: #p freq=noraman PBEPBE/SDD
converged: YES YES NO NO
title: Mulliken charges:
elementType: O C C C C C C C C C H H H H H H H H H H H H H H H H
charge: -0.179924 -0.017374 -0.449890 -0.442211 -0.406850 -0.405568 -0.128210 -0.381896 -0.741876 -0.111113 0.191917 0.195426 0.207595 0.217008 0.197869 0.200051 0.192308 0.190913 0.201917 0.238736 0.201482 0.190332 0.211302 0.238108 0.234804 0.155142
chargesum: 0.00000
title: Mulliken charges with hydrogens summed into heavy atoms:
elementType: O C C C C C C C C C
charge: -0.179924 0.174543 -0.046869 -0.027333 -0.014491 -0.012738 0.110526 0.009919 -0.057662 0.044029
polarizability: 1.09775133e+02 -3.00383098e+00 9.60654462e+01 -1.50543044e+00 1.10187421e+00 8.08337311e+01
1716.lowfreq: -36.7174 -19.6073 -0.0006 -0.0003 -0.0003 6.1223 49.5994 56.2682 100.8866
frequency: 49.2111 55.6015 100.8347 152.9444 201.5099 220.9021 258.5452 287.9334 345.2948 353.5441 379.3482 427.5178 447.8726 486.3172 575.6987 779.7941 784.5797 836.8564 870.3837 876.1663 889.3658 913.3427 916.6804 947.1647 986.5816 1044.5055 1050.8046 1057.9958 1081.6362 1092.4167 1112.7483 1134.6374 1156.0353 1192.6548 1217.5691 1255.8823 1258.8344 1267.5491 1278.0037 1308.9678 1314.3776 1328.8806 1336.0182 1339.2125 1342.6445 1361.4287 1381.0922 1388.5936 1458.9654 1461.5048 1464.3928 1469.1194 1473.3711 1477.6368 1481.7001 1643.4761 2823.0041 2925.6259 2957.8670 2962.3880 2964.7696 2965.2547 2967.1916 2979.5719 3006.4911 3018.1913 3027.6534 3028.1705 3032.6746 3042.1977 3074.4941 3088.8334
redmass: 3.7224 4.5108 2.6067 2.0620 1.2872 1.7566 2.2055 2.4759 2.5801 2.3918 3.0778 3.0311 2.1453 2.0428 2.3519 1.8693 1.6595 2.2331 1.9809 1.4699 1.5385 1.8679 2.0190 2.2987 1.5962 2.2723 1.7061 1.2089 1.6400 2.3183 2.4891 1.7465 2.5763 1.4776 1.4379 1.2678 1.2438 1.3093 1.2676 1.2949 1.3187 1.4183 1.3885 1.5172 1.4962 1.4584 1.1790 1.2130 1.0871 1.0892 1.0880 1.0761 1.0680 1.0880 1.0463 8.0021 1.0834 1.0812 1.0623 1.0619 1.0622 1.0646 1.0632 1.0362 1.0854 1.0975 1.0977 1.0969 1.0991 1.1033 1.0990 1.0991
irintensity: 2.1192 6.6628 0.2768 1.0163 0.3585 0.2256 1.9591 2.4137 2.3026 1.3651 0.5419 0.1307 3.8914 2.6479 3.8084 0.7276 0.5345 4.6601 10.2522 17.2903 14.1494 0.6940 11.3152 1.9614 21.5226 1.9840 0.8884 0.8288 0.0238 3.1908 0.0375 4.8434 1.7542 0.3377 2.0501 1.8376 1.6610 0.9485 0.9719 0.7413 0.7840 0.0915 0.4850 1.7298 0.5200 1.7922 9.8072 4.5377 2.8490 4.0200 9.1851 21.9197 10.5537 1.2616 15.1595 165.2927 101.9952 15.8318 23.3665 57.9744 27.8997 23.8138 32.2540 22.7891 12.2201 67.5048 35.9124 86.0170 0.5398 132.8174 37.0469 23.7963
temp: 298.150 k
press: 1.00000 atm
elementType: 8 6 6 6 6 6 6 6 6 6 1 1 1 1 1 1 1 1 1 1 1 1 1 1 1 1
symmnumber: 1
zpe: 605555.8 jmol-1
zpe.correction: 0.230644 hartree
zpe.thermalcorrener: 0.241533 hartree
zpe.thermalcorrenthalpy: 0.242477 hartree
zpe.thermalcorrgfe: 0.193854 hartree
zpe.sumelectzpe: -426.960023 hartree
zpe.sumelectthermal: -426.949134 hartree
zpe.sumelectthermalent: -426.948190 hartree
zpe.sumelectthermalfe: -426.996813 hartree
dipole: -2.5165 2.1406 1.0184
dipole: 3.4572
quadrupole: -73.0076 -65.1432 -61.3402
quadrupole: 7.7503 3.3461 -1.4317
quadrupole: -6.5106 1.3538 5.1568 7.7503 3.3461 -1.4317
hfenergy: -427.1906667 hartree
pointgroup: C01 [X(C9H16O1)]
dipole: 1.0282969 0.8054254 -0.3794304 debye
dipolederiv: -0.6794333 -0.3089145 0.0757676 -0.3590884 -0.5573757 0.0533585 0.1583037 0.1125479 -0.4638114 0.1397972 0.0128686 0.0118969 -0.0184505 0.0174753 -0.013653 -0.0296967 -0.0500128 0.1504216 -0.0514491 -0.0058737 0.0047667 0.04088 0.0650668 -0.0297569 0.0556476 0.0165759 0.1523692 -0.0141311 0.0382853 0.013957 0.0332435 0.0307132 0.010908 0.0294922 -0.0304788 0.1403186 0.0688426 0.0185493 0.0086278 -0.0112482 0.0533629 0.0113431 -0.0472185 -0.014819 0.1539481 0.0487162 -0.0138011 -0.0019209 0.00857 0.0657361 -0.0244962 -0.0329864 0.0096707 0.153908 -0.159289 -0.1499709 -0.016837 -0.2240539 -0.2199989 -0.0458053 -0.1117497 -0.0660885 0.0479003 0.0601068 -0.0046253 -0.0237124 -0.0104693 0.0321004 -0.0042834 0.0236184 -0.011316 0.1488769 -0.0471101 -0.0268622 -0.0192923 0.0404253 -0.0097704 0.0126478 -0.0369786 -0.0824822 0.0827353 0.6711869 0.5307229 -0.0957809 0.6361407 0.5892129 -0.0287549 0.0202797 0.0752137 0.7379639 0.0341191 0.0021681 -0.0102484 -0.0023557 0.0180476 0.0139578 -0.0060298 0.0167081 -0.1896492 0.0292773 -0.0136087 0.0323918 -0.0207858 0.0705109 0.0366875 0.0195063 -0.0300058 -0.1761066 0.0424338 0.0812337 -0.0159992 0.0814401 -0.1853368 0.0367319 -0.0263349 0.0590297 0.0496626 -0.0933152 -0.1102458 -0.0563822 -0.1194218 -0.0542984 -0.0406905 -0.0758589 -0.0612291 0.0382831 0.0432758 0.0202366 0.0210771 0.0215478 0.0534221 -0.0187085 0.0359117 0.0437003 -0.1661807 -0.1030878 -0.118854 -0.048048 -0.1218823 -0.0936252 -0.0558857 -0.0744751 -0.081719 0.0451716 0.0462319 0.0307943 -0.009457 0.0350277 0.0472772 0.0081205 0.051634 0.0589475 -0.1911323 0.021268 -0.0141032 -0.0069605 -0.0265059 0.0770356 0.0358502 0.0249251 -0.0354841 -0.1969508 -0.002291 0.069621 -0.0106355 0.0846947 -0.2031768 0.0363084 -0.0220187 0.0707257 0.065625 0.0342251 0.0022611 -0.024214 -0.0021105 0.0299647 0.0418852 -0.003784 0.0139003 -0.1302508 -0.2283602 0.0554235 0.0522179 0.0542305 0.030945 -0.0126517 0.088899 -0.02111 0.0585081 0.0861969 -0.0166351 0.0243644 -0.0115871 0.0194436 0.0101949 -0.0501371 0.0264428 -0.1960114 0.0957458 -0.0032027 0.0427235 0.0204554 0.0673492 -0.011033 -0.000775 0.0652078 -0.1484101 0.0681125 -0.1075676 -0.0639902 -0.1050209 -0.0607648 -0.0534316 -0.058409 -0.0442497 0.0444437 -0.1515303 0.0800012 0.0506703 0.0312005 0.0727015 0.0079785 0.0588988 -0.0025847 0.080953 0.0404615 -0.0479008 0.0650175 -0.0548759 0.043982 0.0231783 0.0093359 -0.0370908 -0.2925855 unknown
polarizability: 110.0297416|2.4522791|95.8640299|-1.2119643|-0.816085|80.7805389 unknown
InChI: InChI=1S/C9H16O/c1-8(7-10)9-5-3-2-4-6-9/h7-9H,2-6H2,1H3
charge 0 multiplicity 1
26 atoms
O  -3.194905 -1.217972 0.251346
C  0.032981 0.245007 -0.245539
C  1.041886 1.280805 0.317265
C  0.47891 -1.193881 0.131364
C  2.493559 0.978522 -0.129895
C  1.927521 -1.495573 -0.319083
C  -1.427395 0.514794 0.241232
C  2.92029 -0.45718 0.252518
C  -1.957068 1.922413 -0.156925
C  -2.373855 -0.507482 -0.375595
H  0.043152 0.329293 -1.356785
H  0.989477 1.263276 1.426819
H  0.76557 2.303612 -0.00187
H  -0.213723 -1.937989 -0.31024
H  0.403273 -1.312403 1.232947
H  3.184511 1.718757 0.31849
H  2.567909 1.098538 -1.231015
H  1.978349 -1.475132 -1.42788
H  2.215117 -2.517643 -0.005373
H  -1.476495 0.403106 1.342407
H  3.945248 -0.6622 -0.112664
H  2.947879 -0.547885 1.358309
H  -1.886427 2.08148 -1.249904
H  -1.3733 2.714842 0.341361
H  -3.013429 2.04564 0.142212
H  -2.309637 -0.562645 -1.497905
