program: Gaussian 09
title: 000095550
version: EM64L-G09RevD.01
frameworkgroup: C1[X(C10H10O2)]
method: RPBEPBE
basis: SDD
operation: Freq
keyword: #pfreq=noraman
keyword: PBEPBE/SDD
title: #p freq=noraman PBEPBE/SDD
converged: YES YES NO NO
title: Mulliken charges:
elementType: O O C C C C C C C C C C H H H H H H H H H H
charge: -0.243820 -0.173847 -0.244143 0.397811 -0.536117 -0.685157 0.167059 0.153438 -0.423540 -0.358485 -0.242105 -0.214249 0.241311 0.252170 0.258948 0.220941 0.227840 0.235874 0.238517 0.261931 0.230903 0.234722
chargesum: 0.00000
title: Mulliken charges with hydrogens summed into heavy atoms:
elementType: O O C C C C C C C C C C
charge: -0.243820 -0.173847 -0.002832 0.397811 -0.024999 -0.000502 0.167059 0.153438 -0.185023 -0.096554 -0.011202 0.020472
polarizability: 1.51411995e+02 -2.49503247e-01 1.09668706e+02 1.64698685e-02 -6.89618857e+00 6.41251981e+01
1716.lowfreq: -9.0112 -0.0008 -0.0001 0.0003 6.5240 14.2639 80.8565 104.7096 124.9894
frequency: 80.8454 104.7027 124.9860 216.1859 235.5930 267.7716 336.5254 349.4308 413.0321 457.8569 475.1774 498.5544 545.2323 568.3774 588.1373 683.2236 716.0777 749.1630 765.9323 801.5938 855.3049 872.6054 878.8326 937.3266 948.0330 982.0069 984.2518 1027.6749 1064.5672 1076.7178 1106.6816 1125.6085 1168.8625 1171.4652 1204.9553 1227.3053 1249.9420 1287.5747 1312.3276 1345.0387 1389.7784 1391.6050 1439.0386 1443.2995 1471.0961 1472.1867 1483.6152 1592.6336 1617.9152 1692.6962 2981.4196 2991.3671 3012.5336 3078.4024 3087.6029 3090.1146 3122.3530 3141.8756 3160.4112 3175.8483
redmass: 6.1488 3.3108 3.6932 1.9975 1.4771 3.8427 3.5176 2.7744 5.9712 5.6615 3.3988 4.0036 3.4554 3.7878 5.6736 5.3101 5.2648 3.4740 1.2832 3.3789 4.3749 1.4371 2.8108 1.9975 1.3818 1.8923 1.3194 2.1052 2.1468 1.7826 1.9006 3.6300 1.1882 1.7870 1.8077 1.4016 1.7358 1.5680 1.4684 1.5751 4.2341 1.3399 1.0912 2.3056 1.1139 1.6829 1.2949 6.7633 7.4430 11.7025 1.0354 1.0661 1.0846 1.1004 1.0990 1.0972 1.0883 1.0888 1.0947 1.0992
irintensity: 0.4908 4.2435 0.6813 0.1098 0.0622 1.6836 0.7344 0.7386 1.0221 6.8126 10.9920 2.9884 4.0133 0.2062 3.7090 0.9102 1.7770 1.8839 91.1653 37.3064 25.3881 1.9147 31.3430 1.8007 2.9175 48.8733 0.3917 4.2424 115.7479 2.5278 102.8336 145.6537 5.4501 40.7116 16.3744 16.5581 0.8709 11.0987 0.6216 10.4058 2.6996 13.6959 16.9358 46.3687 17.2449 24.3318 26.8069 12.2780 26.8828 333.3321 24.3381 9.0184 19.2147 32.3337 13.1563 24.3562 6.8595 9.4525 20.2130 10.6803
temp: 298.150 k
press: 1.00000 atm
elementType: 8 8 6 6 6 6 6 6 6 6 6 6 1 1 1 1 1 1 1 1 1 1
symmnumber: 1
zpe: 458416.6 jmol-1
zpe.correction: 0.174602 hartree
zpe.thermalcorrener: 0.184566 hartree
zpe.thermalcorrenthalpy: 0.185510 hartree
zpe.thermalcorrgfe: 0.139313 hartree
zpe.sumelectzpe: -536.655217 hartree
zpe.sumelectthermal: -536.645253 hartree
zpe.sumelectthermalent: -536.644309 hartree
zpe.sumelectthermalfe: -536.690506 hartree
dipole: -2.9420 3.5066 -1.2798
dipole: 4.7529
quadrupole: -73.6742 -68.3173 -70.8913
quadrupole: 9.5092 -2.6748 -0.3737
quadrupole: -2.7133 2.6436 0.0697 9.5092 -2.6748 -0.3737
hfenergy: -536.829819 hartree
pointgroup: C01 [X(C10H10O2)]
dipole: 1.1917118 -1.3458336 -0.5149509 debye
dipolederiv: -1.9065671 0.1847213 -0.0710414 -0.2727104 -0.3408321 -0.0887346 -0.2276372 -0.0688641 -0.260237 -1.3065022 0.2371254 0.0079606 0.3533225 -0.5406015 -0.0680597 0.1520698 -0.1216688 -0.3488009 0.0825941 -0.0189762 0.0016401 -0.0346742 0.1546081 -0.0125496 0.0704189 0.0587738 0.1612503 -0.0481004 0.1058718 -0.0386117 0.3043759 -0.0447261 0.0047059 0.0064999 -0.0028418 -0.1202979 -0.0460909 0.0770223 0.0122013 -0.0091233 -0.1751562 -0.1223349 0.0197218 -0.1574381 -0.0265935 -0.0084441 -0.0335636 0.0197719 -0.0162358 0.0276025 0.0563421 -0.0381514 -0.0032512 -0.0286935 1.0629547 -0.2328855 -0.0166735 -0.4505195 0.1797534 -0.0102849 -0.1639344 0.0133661 0.075316 2.3152891 -0.2569278 0.0622867 0.240418 0.7161907 0.2993686 0.1793912 0.3097222 0.394469 -0.0039491 -0.0274288 -0.0036397 -0.0548536 0.0861568 0.047315 0.0037592 0.0424027 -0.1357962 -0.2724515 0.0488192 -0.006461 -0.0422819 0.0386967 0.0458053 -0.0064346 0.0476937 -0.1426979 0.0042397 -0.0649735 -0.0244317 -0.0680839 -0.0865057 0.0236208 -0.0136938 0.0197002 -0.1535351 0.0846677 0.0162096 0.0057611 0.0629428 0.0525678 0.0429223 0.0016156 0.0419505 -0.1507846 0.0226253 0.0567869 0.0392806 0.0140839 -0.0756506 -0.0895135 0.0091196 -0.0878079 -0.0363564 -0.0855126 -0.0726239 -0.0225674 -0.060836 0.040758 -0.020979 0.0085165 0.0060932 0.1152162 0.1194194 0.0117615 0.0646169 0.0153462 0.0295973 0.0655978 0.020358 0.0561834 -0.0583103 -0.1054627 -0.160845 0.0098199 -0.1289824 -0.000018 0.0108198 -0.0015974 0.0058705 0.0595027 -0.0200059 0.1268696 -0.0760922 0.08172 0.0247608 0.0700175 -0.0471408 0.0459625 0.0368138 0.0844575 0.0160352 0.0283996 0.0433909 -0.0382646 -0.1202584 0.0173616 -0.0621793 0.0083254 0.0829282 -0.0117522 -0.0074611 0.0298811 -0.0981891 -0.0485559 -0.0016544 -0.0511284 0.132239 0.0992363 0.0290889 0.01021 0.0156216 -0.0331197 -0.0372448 0.0059181 -0.04214 0.1634848 -0.0983129 0.0650893 0.0202774 0.0771235 0.0590344 -0.0231547 0.0204614 -0.0251246 0.1594275 -0.0570124 -0.0954243 -0.0152465 -0.0999253 0.0233371 -0.0248451 -0.0149676 -0.0252746 0.1560587 unknown
polarizability: 151.3869092|0.9543311|109.6532914|-0.80313|6.9967596|64.165699 unknown
InChI: InChI=1S/C10H10O2/c1-7-6-10(11)12-9-5-3-2-4-8(7)9/h2-5,7H,6H2,1H3
charge 0 multiplicity 1
22 atoms
O  -0.882287 1.320613 0.30041
O  -3.159594 1.222175 0.113171
C  -0.759842 -1.514104 -0.272796
C  0.50984 -0.679555 -0.172292
C  -1.876111 -0.633017 -0.893361
C  -1.177271 -2.073295 1.114782
C  0.392134 0.70472 0.099785
C  -2.075217 0.672262 -0.133453
C  1.811106 -1.215205 -0.307371
C  1.514119 1.543157 0.24249
C  2.954116 -0.39579 -0.168518
C  2.803386 0.984322 0.107565
H  -0.579771 -2.369438 -0.950992
H  -2.847627 -1.153284 -0.915407
H  -1.606743 -0.372674 -1.936919
H  -2.090584 -2.690173 1.028731
H  -0.373577 -2.699531 1.539713
H  -1.381475 -1.256428 1.831012
H  1.925707 -2.284518 -0.523734
H  1.363685 2.605382 0.456739
H  3.954378 -0.827841 -0.277096
H  3.68513 1.624522 0.21604
