program: Gaussian 09
title: 000095547
version: EM64L-G09RevD.01
frameworkgroup: C1[X(C16H14O3)]
method: RPBEPBE
basis: SDD
operation: Freq
keyword: #pfreq=noraman
keyword: PBEPBE/SDD
title: #p freq=noraman PBEPBE/SDD
converged: YES YES NO NO
title: Mulliken charges:
elementType: O O O C C C C C C C C C C C C C C C C H H H H H H H H H H H H H H
charge: -0.258777 -0.469467 -0.265481 0.491820 0.144580 -0.282273 -0.357105 -0.396503 0.105085 0.221794 0.322568 -0.343142 -0.364788 -0.370501 -0.322029 -0.406634 -0.260459 -0.204542 -0.536584 0.268410 0.238464 0.236907 0.289643 0.251335 0.242912 0.287188 0.212204 0.233171 0.230988 0.363016 0.225052 0.225100 0.248050
chargesum: 0.00000
title: Mulliken charges with hydrogens summed into heavy atoms:
elementType: O O O C C C C C C C C C C C C C C C C
charge: -0.258777 -0.106451 -0.265481 0.491820 0.144580 -0.013863 -0.118641 -0.159596 0.105085 0.221794 0.322568 -0.053500 -0.113453 -0.127589 -0.034841 -0.194430 -0.027288 0.026446 0.161618
polarizability: 4.27590949e+02 5.97261550e+00 1.86487985e+02 -1.99525490e+00 1.51783711e-01 7.63184513e+01
1716.lowfreq: -6.8466 -0.0008 -0.0003 0.0003 0.7817 3.5622 12.3687 28.7506 44.5645
frequency: 10.9436 28.4274 44.5403 56.0554 103.9390 116.6584 148.8838 159.9436 187.0094 192.0339 241.2453 249.3386 251.6748 301.5583 362.8115 371.4968 376.6497 419.3662 426.4686 436.5466 447.4627 516.5713 525.6187 528.9150 541.4330 554.3194 631.5335 632.9988 667.1942 718.0261 731.0808 756.3970 768.4272 784.5927 814.8524 821.0911 838.5582 855.0474 884.2182 913.5406 949.8279 958.8746 971.1751 983.7026 998.5329 1003.5761 1022.5033 1024.2146 1056.4411 1081.2633 1112.3226 1114.5238 1155.6737 1157.1770 1172.5095 1179.8249 1202.2419 1219.6730 1233.4765 1246.4230 1287.9243 1296.5836 1317.4222 1337.7351 1382.3789 1390.8838 1426.6797 1432.8136 1436.8023 1467.5036 1471.8972 1480.6583 1501.6376 1505.7748 1567.5813 1591.8319 1608.7593 1618.3532 1631.3353 2965.4372 3055.8767 3095.7218 3105.3927 3129.1437 3130.6036 3139.4274 3143.5086 3152.0667 3166.1079 3169.3805 3170.1506 3188.6636 3568.8323
redmass: 5.5057 3.7591 5.6653 5.3837 4.4565 3.8685 4.1408 4.4675 6.4631 1.8867 1.5602 3.9670 3.6034 6.3244 7.0466 3.4092 1.1962 2.9062 5.1523 3.5448 5.0509 2.5992 3.7310 4.0989 7.6200 4.5965 6.7479 6.8592 3.6631 5.6729 3.4081 2.0582 1.8972 6.4432 1.2991 6.3372 1.5908 1.4784 4.5811 1.8968 1.3992 1.3553 1.3595 8.8264 2.6461 1.3414 1.2225 3.5235 2.3781 2.0769 1.2600 1.3779 1.2674 1.3234 1.0823 1.2649 2.4797 1.8865 2.4244 2.3725 1.4830 1.6553 1.4227 2.1017 3.9729 5.8905 2.5989 3.5694 1.2012 1.0504 1.0813 2.4783 2.6264 6.9985 6.6389 6.4883 6.2851 6.1909 5.3291 1.0327 1.1042 1.0891 1.0889 1.0935 1.0955 1.0879 1.0881 1.0926 1.0941 1.1002 1.0966 1.0910 1.0657
irintensity: 0.1758 3.2584 1.2184 0.5990 2.9339 4.2866 1.4607 1.6336 0.3405 0.2510 0.2068 3.5782 2.9358 8.8053 2.1375 16.7454 110.9474 0.0948 22.7891 0.3626 12.9803 34.8636 7.4976 10.8475 5.0798 34.4334 6.6702 9.2156 5.3281 6.8993 0.1756 44.6749 60.2101 7.9822 12.0306 26.2095 69.1220 0.6446 8.9071 5.6114 2.9848 1.1658 0.7439 65.8142 4.0687 0.5551 53.1206 84.4606 8.0629 141.0977 0.2863 14.2719 56.1471 11.7339 13.6694 247.8426 142.3538 8.5466 113.0796 208.8997 81.0297 9.7357 44.6489 116.0083 39.2246 17.5785 10.9948 100.6747 12.2646 15.8526 71.6357 36.8765 335.1290 214.9971 61.8725 43.2682 299.6384 210.2104 190.5027 96.2239 44.8006 2.2988 13.4335 29.0298 5.1317 10.0782 6.4540 3.2021 20.5137 44.2439 5.0692 26.3452 31.3248
temp: 298.150 k
press: 1.00000 atm
elementType: 8 8 8 6 6 6 6 6 6 6 6 6 6 6 6 6 6 6 6 1 1 1 1 1 1 1 1 1 1 1 1 1 1
symmnumber: 1
zpe: 671082.9 jmol-1
zpe.correction: 0.255602 hartree
zpe.thermalcorrener: 0.272727 hartree
zpe.thermalcorrenthalpy: 0.273672 hartree
zpe.thermalcorrgfe: 0.208298 hartree
zpe.sumelectzpe: -842.403874 hartree
zpe.sumelectthermal: -842.386749 hartree
zpe.sumelectthermalent: -842.385805 hartree
zpe.sumelectthermalfe: -842.451178 hartree
dipole: -1.9731 -3.3572 -0.0100
dipole: 3.8941
quadrupole: -67.1167 -102.6681 -117.4065
quadrupole: -21.6266 -0.7029 -0.6452
quadrupole: 28.6137 -6.9377 -21.6761 -21.6266 -0.7029 -0.6452
hfenergy: -842.6594762 hartree
pointgroup: C01 [X(C16H14O3)]
dipole: 0.7352834 0.8332542 1.0546572 debye
polarizability: 425.1985882|-10.8506155|122.8170717|26.3513391|53.5768621|142.3817246 unknown
InChI: InChI=1S/C16H14O3/c1-19-13-9-6-12(7-10-13)8-11-16(18)14-4-2-3-5-15(14)17/h2-11,17H,1H3
charge 0 multiplicity 1
33 atoms
O  5.890083 0.595762 1.141855
O  -2.295861 1.300703 1.433555
O  -1.823916 -1.438579 -1.885407
C  1.987288 -0.335683 -0.255238
C  -3.144583 -0.035533 -0.450051
C  0.650612 -0.663899 -0.748689
C  2.229466 0.607887 0.793068
C  3.116723 -0.97722 -0.837443
C  -1.816977 -0.590255 -0.925862
C  -3.375843 0.848069 0.647737
C  4.639915 0.235445 0.629042
C  -0.545961 -0.152172 -0.307432
C  3.528923 0.890558 1.22884
C  4.432226 -0.705653 -0.41085
C  -4.288246 -0.454896 -1.189214
C  -4.687501 1.27913 0.972311
C  -5.591534 -0.032319 -0.876859
C  -5.792563 0.84474 0.215883
C  7.076825 -0.046052 0.565981
H  0.591392 -1.400974 -1.563669
H  1.385875 1.121595 1.265667
H  2.955089 -1.704589 -1.642297
H  -0.604868 0.578882 0.5001
H  3.72119 1.611609 2.029119
H  5.272035 -1.221568 -0.88522
H  -4.094996 -1.136271 -2.024504
H  -4.838769 1.957883 1.823073
H  -6.44183 -0.378061 -1.473011
H  -6.799163 1.187762 0.47874
H  -2.625251 1.884807 2.161587
H  7.1713 0.181248 -0.513245
H  7.051708 -1.142481 0.71617
H  7.928014 0.384723 1.112664
