program: Gaussian 09
title: 000095530
version: EM64L-G09RevD.01
frameworkgroup: C1[X(C7H13NOS)]
method: RPBEPBE
basis: SDD
operation: Freq
keyword: #p
keyword: freq=noraman
keyword: PBEPBE/SDD
title: #p freq=noraman PBEPBE/SDD
converged: YES YES NO NO
title: Mulliken charges:
elementType: S O N C C C C C C C H H H H H H H H H H H H H
charge: 0.173489 -0.283363 -0.353428 0.292030 -0.735482 -0.444673 -0.655668 -0.698599 0.220716 -0.680067 0.255493 0.268513 0.311226 0.285264 0.210034 0.206931 0.248711 0.232866 0.219829 0.214722 0.221469 0.259242 0.230743
chargesum: 0.00000
title: Mulliken charges with hydrogens summed into heavy atoms:
elementType: S O N C C C C C C C
charge: 0.173489 -0.283363 -0.042202 0.292030 -0.211476 -0.159409 0.010007 -0.031182 0.220716 0.031388
polarizability: 1.25538894e+02 5.45190976e+00 9.85147968e+01 1.65030908e+00 -9.85509634e-01 7.64076541e+01
1716.lowfreq: -13.6936 -0.0017 -0.0013 0.0006 7.6529 17.0883 45.8608 86.8289 172.0383
frequency: 45.3457 86.8176 172.0216 205.8417 220.8723 246.3995 270.2740 282.0367 291.7565 306.4130 354.8230 365.4393 414.7785 437.4574 458.5274 544.7445 620.4746 683.9732 714.2661 727.3852 762.7237 808.1215 890.4644 923.9140 950.6736 960.9695 996.4207 1005.4188 1082.2901 1089.9051 1123.8731 1163.6626 1205.8766 1238.3823 1258.4329 1276.8029 1279.0262 1359.6477 1373.5989 1387.2858 1390.0000 1410.4875 1431.7825 1461.5168 1462.6765 1465.2100 1477.4601 1479.4223 1486.3112 1595.9047 2977.4431 2982.1926 2999.6935 3000.2443 3016.7747 3072.1981 3079.8858 3090.1889 3096.2513 3098.6989 3102.2264 3112.4132 3483.0065
redmass: 3.7243 4.2424 2.9167 1.0607 1.0635 1.3873 2.7082 1.9646 2.8672 3.3560 2.9019 4.3305 3.6002 3.5591 3.4931 4.0170 2.8011 1.9334 4.9539 2.4648 3.4297 2.7937 1.8898 1.4930 1.8827 1.8751 1.3686 1.3777 1.4953 2.6397 1.5703 2.2942 1.2446 2.1931 2.2155 1.5170 1.3541 5.6822 1.2052 1.2659 1.2148 1.4656 1.1082 1.0521 1.0600 1.0450 1.0573 1.0688 1.0741 4.5203 1.0355 1.0357 1.0830 1.0354 1.0612 1.0992 1.0995 1.1010 1.1003 1.1010 1.1029 1.0997 1.0746
irintensity: 2.5752 0.6778 1.3196 0.0569 0.1299 0.5865 4.1586 0.5671 1.8184 1.7568 6.6943 1.3579 3.0742 2.2593 8.5497 2.9236 15.6720 50.0238 2.6415 43.6506 10.8721 2.1493 6.1244 1.4752 11.8531 5.1793 6.7871 1.8472 9.8623 5.8854 11.8134 22.7885 14.6817 5.9291 27.2644 7.1811 3.0944 144.9454 26.7654 9.8131 68.4588 5.7274 10.8628 1.0120 8.4512 22.7406 12.6732 7.9906 9.3616 272.7266 19.1906 32.0292 12.1632 21.0415 23.2627 8.7885 42.7319 18.9173 15.4848 25.2773 20.6689 8.0268 10.8588
temp: 298.150 k
press: 1.00000 atm
elementType: 16 8 7 6 6 6 6 6 6 6 1 1 1 1 1 1 1 1 1 1 1 1 1
symmnumber: 1
zpe: 504579.6 jmol-1
zpe.correction: 0.192184 hartree
zpe.thermalcorrener: 0.203420 hartree
zpe.thermalcorrenthalpy: 0.204364 hartree
zpe.thermalcorrgfe: 0.155700 hartree
zpe.sumelectzpe: -801.796581 hartree
zpe.sumelectthermal: -801.785346 hartree
zpe.sumelectthermalent: -801.784402 hartree
zpe.sumelectthermalfe: -801.833065 hartree
dipole: -3.7023 -1.3569 -0.8267
dipole: 4.0289
quadrupole: -64.1205 -78.5775 -67.6948
quadrupole: -5.5301 -0.6544 0.7040
quadrupole: 6.0104 -8.4466 2.4361 -5.5301 -0.6544 0.7040
hfenergy: -801.9887656 hartree
pointgroup: C01 [X(C7H13N1O1S1)]
dipole: 1.5002476 0.4536268 -0.2365717 debye
dipolederiv: -0.303191 -0.0052055 -0.0243481 -0.0061117 -0.2390461 0.0718335 -0.026469 0.035002 -0.1234174 -0.9273959 -0.1267554 -0.0519699 -0.5349052 -0.9395076 -0.0515847 -0.0218874 0.0420593 -0.350434 -1.2273384 -0.1872644 -0.0852984 0.1197067 -0.2567233 -0.0246839 -0.0215938 -0.0231099 -0.4961118 0.4536359 0.1261252 0.0779809 0.2262594 0.2830123 0.0845903 0.1071856 0.000316 0.3378052 0.1929218 -0.070631 -0.084566 -0.1219871 0.0503126 -0.0091914 -0.0848534 0.0100194 0.083431 0.1914937 0.2954641 0.0935667 0.2477962 0.0436533 0.0486167 0.073785 0.1173385 0.1673899 -0.0622741 0.0180159 -0.0122029 -0.010877 0.0227984 0.0017407 -0.0206214 -0.0398435 -0.148603 -0.0812452 0.003128 0.0391743 0.0826569 0.0002873 -0.0673246 0.0036097 -0.0066192 0.0050261 1.5442821 0.1153724 0.1335972 0.1828568 0.893703 -0.0343328 0.1115158 -0.159467 0.1291967 -0.0613209 -0.0428293 0.0426991 -0.1103072 -0.001452 -0.0006047 -0.0479989 -0.0433173 0.0586092 -0.0654191 -0.0925579 0.000897 -0.0625782 0.0176098 -0.0129964 -0.0145991 -0.0407212 0.0998453 0.0071377 0.0383661 -0.0100267 0.0662697 0.0575934 -0.0521166 0.0279105 0.0101946 -0.147315 0.1157845 0.0142895 -0.0277734 -0.0010829 0.0885618 0.0187123 -0.0394201 0.0418692 0.2943706 0.0137649 -0.0155025 0.0231742 -0.0358717 -0.0006672 -0.0228661 -0.0214798 -0.0115313 -0.1060636 0.0770352 0.0451089 -0.0426069 0.0824055 -0.1171378 0.0993054 -0.0209202 0.0454566 0.04884 -0.0880711 -0.1130604 -0.0439842 -0.1527103 -0.0001467 -0.0218553 -0.0296174 0.0054513 0.0648746 0.0111732 0.0372782 0.1217052 0.0236306 0.0726371 -0.0706552 0.0811489 -0.0382464 0.0349041 0.0804757 -0.0039733 -0.0767597 0.0010579 0.0927268 -0.0121883 -0.0284619 -0.0350436 -0.137647 -0.0682438 -0.0934638 0.0023456 -0.1453372 -0.0076792 -0.0083405 -0.0113128 -0.0282045 0.0930606 0.0417747 0.0517185 0.0087591 0.1180035 -0.1162868 0.0546449 -0.0128882 0.0936221 0.0494973 0.045991 0.0733539 -0.0110975 0.1465899 -0.0778846 0.0497153 -0.0069993 0.0555665 0.077089 0.0197926 -0.0706916 -0.0202893 -0.1329179 0.0328938 -0.0512213 -0.0213177 -0.0426666 0.0869214 0.0892364 0.0037144 -0.0529761 0.0174531 0.1007418 0.0108027 0.0252849 0.0118748 -0.1212692 unknown
polarizability: 126.2608046|3.319354|97.2000619|-0.0406404|3.8333282|77.0004782 unknown
InChI: InChI=1S/C7H13NOS/c1-5-6(9)8-7(2,3)4-10-5/h5,8H,4H2,1-3H3
charge 0 multiplicity 1
23 atoms
S  -0.514159 1.939495 0.229183
O  -1.691543 -1.91597 -0.257108
N  0.424489 -1.023577 -0.115522
C  1.534314 -0.029729 0.01382
C  1.085234 1.333294 -0.554323
C  -1.575142 0.508193 -0.441233
C  1.94741 0.091188 1.504402
C  2.728388 -0.553057 -0.828739
C  -0.948276 -0.883305 -0.239993
C  -2.973924 0.594791 0.192615
H  1.846056 2.101536 -0.340959
H  0.932141 1.274158 -1.646686
H  0.704365 -2.005568 -0.00646
H  -1.652334 0.670517 -1.534331
H  2.208323 -0.900997 1.915326
H  2.829129 0.749869 1.611536
H  1.117005 0.511254 2.097175
H  2.441078 -0.673834 -1.888254
H  3.578975 0.149284 -0.769747
H  3.076718 -1.532263 -0.449112
H  -3.459898 1.55079 -0.069257
H  -3.591806 -0.240878 -0.174128
H  -2.913443 0.516808 1.291994
