program: Gaussian 09
title: 000095541
version: EM64L-G09RevD.01
frameworkgroup: C1[X(C11H20O3)]
method: RPBEPBE
basis: SDD
operation: Freq
keyword: #pfreq=noraman
keyword: PBEPBE/SDD
title: #p freq=noraman PBEPBE/SDD
converged: YES YES NO NO
title: Mulliken charges:
elementType: O O O C C C C C C C C C C C H H H H H H H H H H H H H H H H H H H H
charge: -0.278069 -0.263288 -0.244934 -0.003770 -0.481509 -0.413331 -0.453874 -0.296312 -0.384308 -0.284560 -0.486952 0.252739 -0.344749 -0.684258 0.205654 0.232397 0.216856 0.198232 0.208065 0.225898 0.225327 0.221471 0.190765 0.202086 0.248864 0.219455 0.226012 0.236709 0.238064 0.215384 0.217781 0.208231 0.207748 0.222176
chargesum: 0.00000
title: Mulliken charges with hydrogens summed into heavy atoms:
elementType: O O O C C C C C C C C C C C
charge: -0.278069 -0.263288 -0.244934 0.201884 -0.032256 -0.007034 -0.002649 0.115923 0.066641 0.160907 -0.012178 0.252739 0.088417 -0.046103
polarizability: 1.68753519e+02 -9.93705716e-02 1.13416406e+02 1.35107128e+00 1.25489568e+00 1.02894467e+02
1716.lowfreq: -13.9897 -4.3339 -1.4233 0.0001 0.0010 0.0011 18.2834 21.5134 25.9199
frequency: 17.3825 19.8895 25.5659 40.2987 48.3418 68.9830 86.4746 118.7153 125.3331 176.5350 187.7259 210.9879 227.1353 245.0245 308.4217 332.8949 409.0248 430.8056 493.4298 546.9056 567.9486 635.9415 678.9493 733.7010 734.8707 775.8045 849.5543 856.6605 865.7063 866.7456 885.5309 894.5415 907.1517 924.2338 956.6469 1000.1192 1021.9744 1045.4580 1052.4518 1054.0629 1088.3919 1098.0562 1109.2024 1111.1386 1134.5884 1138.7641 1147.8035 1167.5460 1177.8863 1217.5783 1218.3856 1246.2561 1259.0150 1278.3641 1283.7185 1284.4840 1288.1020 1308.4243 1312.5715 1322.9578 1340.8698 1356.3136 1362.8249 1376.1652 1392.1814 1440.6318 1447.4363 1460.7776 1467.9202 1471.2081 1472.6797 1478.1881 1485.5981 1486.5765 1490.3366 1638.8943 2956.4007 2960.2672 2961.3051 2972.6183 2986.8325 2992.2207 2997.0827 2998.7715 3004.1194 3011.6400 3021.8087 3029.0681 3049.1334 3049.8584 3062.7660 3073.0060 3075.6249 3077.0524 3080.3625 3087.9697
redmass: 1.9920 2.8022 4.4327 4.1585 3.9327 3.2769 2.6370 2.5101 2.6226 4.1481 3.0378 3.2287 1.0753 2.0915 3.6800 3.5611 3.7963 2.9029 3.0963 2.6200 2.0249 3.5608 5.6393 1.6455 1.1825 1.6416 1.4160 2.0595 4.8648 1.3736 2.5129 1.4742 2.3237 2.5013 3.4603 2.1537 2.1675 2.8659 2.4164 2.3839 2.2576 1.5645 2.9129 1.9970 1.8298 2.7317 1.5188 1.4585 1.2977 1.3441 1.3310 1.2587 1.2192 1.2151 1.1792 1.0987 1.4969 1.1790 1.3475 1.3057 1.2910 1.5617 1.6798 1.6671 1.2166 1.0864 1.0860 1.0890 1.0992 1.0815 1.0556 1.0423 1.0778 1.0915 1.0921 9.7993 1.0760 1.0751 1.0617 1.0360 1.0610 1.0598 1.0631 1.0625 1.0608 1.0621 1.0967 1.0980 1.1038 1.1007 1.0971 1.1003 1.0988 1.1023 1.1047 1.1057
irintensity: 0.0079 1.1808 0.0972 5.9700 0.8408 0.6828 1.0176 0.1816 1.6691 4.8674 6.0922 1.0022 0.0060 1.1905 16.6267 1.8243 5.5598 4.2621 4.7938 1.1688 1.1359 1.9145 4.3802 2.7452 13.3435 11.2151 0.9327 16.8017 6.6756 0.2819 7.5420 5.6704 22.7066 11.1780 66.5056 58.1588 1.8995 32.9440 40.6488 20.5399 14.4256 4.9449 123.1777 1.5198 9.8909 268.6834 0.9378 4.6034 3.6037 0.1313 2.8646 6.3320 0.3120 2.4734 13.8350 2.5967 65.4727 2.8688 0.8636 11.3894 0.2864 41.7221 2.7526 0.8207 8.1900 24.5436 1.9904 9.5956 11.6750 3.4931 3.2192 12.7288 9.8501 20.4696 1.9298 178.7484 86.0618 14.4438 36.9294 37.1831 6.4709 3.8813 20.8057 43.8438 26.8044 28.2574 37.8954 2.1704 2.8739 0.0143 44.0009 17.2067 49.0508 70.0275 62.8848 69.0352
temp: 298.150 k
press: 1.00000 atm
elementType: 8 8 8 6 6 6 6 6 6 6 6 6 6 6 1 1 1 1 1 1 1 1 1 1 1 1 1 1 1 1 1 1 1 1
symmnumber: 1
zpe: 773012.9 jmol-1
zpe.correction: 0.294425 hartree
zpe.thermalcorrener: 0.310950 hartree
zpe.thermalcorrenthalpy: 0.311894 hartree
zpe.thermalcorrgfe: 0.245705 hartree
zpe.sumelectzpe: -655.698216 hartree
zpe.sumelectthermal: -655.681691 hartree
zpe.sumelectthermalent: -655.680747 hartree
zpe.sumelectthermalfe: -655.746937 hartree
dipole: 2.7371 0.0331 -1.0339
dipole: 2.9260
quadrupole: -69.8520 -91.4705 -84.2793
quadrupole: 10.6880 3.4387 -3.2182
quadrupole: 12.0152 -9.6032 -2.4120 10.6880 3.4387 -3.2182
hfenergy: -655.9926412 hartree
pointgroup: C01 [X(C11H20O3)]
dipole: 1.075306 0.0433667 -0.4087429 debye
polarizability: 168.7586498|0.3736624|113.269694|1.1387322|1.7772747|103.0360488 unknown
InChI: InChI=1S/C11H20O3/c1-2-5-11(12)14-9-4-7-10-6-3-8-13-10/h10H,2-9H2,1H3
charge 0 multiplicity 1
34 atoms
O  3.436956 -1.165219 0.158745
O  -1.701672 -0.136556 -0.197622
O  -3.095846 1.421341 0.832511
C  3.270041 0.118566 -0.595676
C  4.580483 0.914758 -0.372182
C  1.997136 0.831883 -0.112888
C  5.626042 -0.18775 -0.068204
C  4.793923 -1.19046 0.756069
C  0.717373 0.01356 -0.397046
C  -0.522949 0.708194 0.162378
C  -4.053091 -0.613096 -0.217972
C  -2.951325 0.345049 0.207278
C  -5.464534 -0.118007 0.154962
C  -6.558511 -1.112873 -0.285163
H  3.160269 -0.160225 -1.665095
H  4.847469 1.530756 -1.247588
H  4.469685 1.585808 0.501345
H  1.93465 1.822107 -0.611743
H  2.096254 1.019967 0.975165
H  6.504208 0.19169 0.482164
H  5.974525 -0.657182 -1.006077
H  5.160302 -2.229671 0.699323
H  4.739601 -0.881758 1.821276
H  0.594738 -0.128177 -1.488483
H  0.8226 -0.989778 0.052783
H  -0.672393 1.717286 -0.266614
H  -0.485556 0.80708 1.263496
H  -3.965747 -0.775432 -1.310219
H  -3.84667 -1.598623 0.244633
H  -5.638805 0.870461 -0.309755
H  -5.515606 0.04741 1.2472
H  -6.42074 -2.099882 0.19585
H  -6.542901 -1.268609 -1.38068
H  -7.563709 -0.743617 -0.012569
