program: Gaussian 09
title: 000095546
version: EM64L-G09RevD.01
frameworkgroup: C1[X(C14H12O3)]
method: RPBEPBE
basis: SDD
operation: Freq
keyword: #pfreq=noraman
keyword: PBEPBE/SDD
title: #p freq=noraman PBEPBE/SDD
converged: YES YES NO NO
title: Mulliken charges:
elementType: O O O C C C C C C C C C C C C C C H H H H H H H H H H H H
charge: -0.447464 -0.401227 -0.235795 0.371776 0.352504 0.340022 -0.276478 -0.371197 -0.394855 -0.394635 -0.389968 -0.394982 -0.394614 0.163105 -0.234918 -0.235165 -0.241236 0.272258 0.254340 0.265598 0.239540 0.239702 0.239132 0.237478 0.226286 0.225653 0.230111 0.365766 0.389266
chargesum: 0.00000
title: Mulliken charges with hydrogens summed into heavy atoms:
elementType: O O O C C C C C C C C C C C C C C
charge: -0.081698 -0.011961 -0.235795 0.371776 0.352504 0.340022 -0.004221 -0.116857 -0.129257 -0.155095 -0.150266 -0.155850 -0.157137 0.163105 -0.008631 -0.009512 -0.011125
polarizability: 2.57809624e+02 2.29885660e+00 1.52991005e+02 4.39440283e+00 -6.65978706e+00 8.60480294e+01
1716.lowfreq: -1.7248 -0.0001 0.0005 0.0007 3.7067 4.8315 22.0825 41.9097 63.5857
frequency: 22.0432 41.9037 63.5828 72.1086 86.6679 125.8343 174.4120 215.8919 268.4743 284.4075 323.7237 376.0341 380.3583 404.9985 408.2930 414.1755 469.6334 490.5437 543.5741 563.2356 604.1280 614.0211 628.5946 638.7194 672.4874 702.6125 718.3681 746.1214 766.4675 814.1883 850.4602 851.1075 859.2807 877.3297 921.4436 965.2845 974.6466 982.6852 988.7626 994.3036 996.1609 1011.9901 1020.1067 1041.4696 1068.3197 1085.7721 1124.7110 1172.6348 1173.8796 1191.5382 1208.4763 1213.5921 1260.0235 1289.9435 1299.8747 1306.3264 1316.4061 1356.3024 1374.4281 1387.4700 1410.7839 1438.6890 1475.9231 1513.5087 1569.5043 1589.4736 1613.3091 1619.2966 1646.4103 3034.2652 3122.6120 3126.7010 3131.0592 3136.6728 3140.9031 3148.8566 3153.1888 3165.0302 3168.3685 3472.5398 3508.3348
redmass: 4.8710 7.2144 5.7562 4.8130 5.6813 5.6110 5.4847 6.9735 5.7024 5.6048 5.1794 2.0948 2.1035 3.1771 3.5051 2.5159 4.0100 3.5116 2.4294 2.6850 3.3294 6.2519 3.0407 5.9867 3.5664 1.7415 3.6640 4.3502 1.8865 2.6116 1.3426 1.3008 2.7350 2.4545 1.4539 1.3745 1.4471 1.4317 4.4853 1.3158 6.2601 5.0461 2.9276 1.9023 2.2971 1.6198 1.3787 1.8993 1.0965 1.1476 1.2417 1.3517 1.4353 2.9575 1.7542 1.3935 1.3679 2.4295 6.2012 1.6771 3.7453 2.3909 2.1417 2.7752 6.1166 6.5932 6.0143 6.2732 8.7009 1.0843 1.0844 1.0874 1.0871 1.0889 1.0915 1.0963 1.0960 1.1015 1.0948 1.0651 1.0641
irintensity: 0.7807 0.3922 0.9397 0.4091 1.2335 0.2830 4.7356 3.4145 5.9853 0.8142 3.9770 89.6631 60.9846 2.5573 1.3438 22.1980 6.2113 12.8110 17.5380 33.0762 53.6090 1.3942 39.9583 6.7712 103.3584 46.4598 1.0148 11.3439 91.5439 11.5307 1.5826 1.1940 13.9128 37.3770 2.5432 1.0440 0.3787 2.0939 0.5702 0.2873 15.0626 135.8445 46.6995 4.9504 139.8865 8.9056 6.2099 20.6301 2.0630 1.4222 8.9172 9.6833 25.1648 1.1758 50.7817 8.7335 0.6548 5.1239 3.1101 31.7100 7.8030 3.4053 56.7600 10.2304 2.9126 0.7550 6.5070 4.4922 234.9512 9.9106 7.9548 1.1686 8.4447 12.2972 8.8704 35.5594 15.7548 25.1721 4.4475 43.1400 30.9183
temp: 298.150 k
press: 1.00000 atm
elementType: 8 8 8 6 6 6 6 6 6 6 6 6 6 6 6 6 6 1 1 1 1 1 1 1 1 1 1 1 1
symmnumber: 1
zpe: 586085.0 jmol-1
zpe.correction: 0.223228 hartree
zpe.thermalcorrener: 0.237817 hartree
zpe.thermalcorrenthalpy: 0.238761 hartree
zpe.thermalcorrgfe: 0.179871 hartree
zpe.sumelectzpe: -765.167738 hartree
zpe.sumelectthermal: -765.153149 hartree
zpe.sumelectthermalent: -765.152205 hartree
zpe.sumelectthermalfe: -765.211095 hartree
dipole: 0.8553 2.4042 0.1882
dipole: 2.5587
quadrupole: -91.1602 -87.5488 -104.9986
quadrupole: -11.0017 1.5114 -1.6469
quadrupole: 3.4090 7.0204 -10.4294 -11.0017 1.5114 -1.6469
hfenergy: -765.3909661 hartree
pointgroup: C01 [X(C14H12O3)]
dipole: -0.3482205 -0.8290598 -0.4525595 debye
polarizability: 257.7504699|4.1135818|126.6178736|-4.4749334|33.3249505|112.4803146 unknown
InChI: InChI=1S/C14H12O3/c15-13(14(16)17)12-8-6-11(7-9-12)10-4-2-1-3-5-10/h1-9,13,15-16H
charge 0 multiplicity 1
29 atoms
O  3.906532 1.591315 0.699845
O  4.046065 -1.518027 -1.193493
O  4.680468 -1.022762 0.989119
C  1.870465 0.464064 -0.199512
C  -0.971438 0.158957 -0.042609
C  -2.452087 -0.000897 0.040017
C  3.398642 0.649315 -0.283559
C  1.171427 -0.275926 -1.185284
C  1.143636 1.057276 0.857226
C  -0.227245 -0.423344 -1.106483
C  -0.255692 0.901344 0.935279
C  -3.271372 1.030657 0.577509
C  -3.086346 -1.189913 -0.416234
C  4.108589 -0.697717 -0.076483
C  -4.671976 0.87887 0.657809
C  -4.486998 -1.342628 -0.3383
C  -5.288267 -0.308984 0.200041
H  3.66926 1.038483 -1.281298
H  1.720838 -0.733777 -2.015376
H  1.682076 1.650763 1.601847
H  -0.753112 -0.969515 -1.897436
H  -0.795512 1.343087 1.780306
H  -2.812072 1.970065 0.905706
H  -2.475876 -2.012511 -0.806046
H  -5.283234 1.690737 1.067771
H  -4.952357 -2.271056 -0.688147
H  -6.375743 -0.42707 0.261426
H  4.265815 1.066918 1.467699
H  4.479913 -2.393623 -1.00094
