program: Gaussian 09
title: 000095502
version: EM64L-G09RevD.01
frameworkgroup: C1[X(C9H18O3)]
method: RPBEPBE
basis: SDD
operation: Freq
keyword: #pfreq=noraman
keyword: PBEPBE/SDD
title: #p freq=noraman PBEPBE/SDD
converged: YES YES NO NO
title: Mulliken charges:
elementType: O O O C C C C C C C C C H H H H H H H H H H H H H H H H H H
charge: -0.267998 -0.293845 -0.247837 -0.416527 0.057432 -0.270788 -0.181782 -0.715241 0.260050 -0.686141 -0.690519 -0.506124 0.204473 0.224587 0.172864 0.260492 0.212838 0.235426 0.215527 0.229011 0.218383 0.219532 0.229549 0.228077 0.212974 0.219549 0.237521 0.205516 0.235048 0.197954
chargesum: 0.00000
title: Mulliken charges with hydrogens summed into heavy atoms:
elementType: O O O C C C C C C C C C
charge: -0.267998 -0.293845 -0.247837 0.012533 0.230296 0.202542 0.053644 -0.052321 0.260050 -0.008982 -0.020476 0.132394
polarizability: 1.36022116e+02 2.34236838e-01 1.00997007e+02 -1.73017781e-01 -1.75954032e+00 9.13697989e+01
1716.lowfreq: -18.0674 -6.3847 -0.0004 0.0002 0.0006 2.4868 8.7687 25.5613 38.5055
frequency: -15.0311 24.7223 37.8912 57.3439 88.5252 102.0123 142.2887 171.8022 187.6621 188.9282 214.5753 223.3237 244.2281 269.7491 276.5289 288.2682 338.5211 381.8870 442.9171 482.7121 527.5875 637.2651 714.5605 740.4992 805.4992 811.9925 873.1904 915.9728 926.2896 940.0361 959.1078 963.0482 1019.5278 1062.1160 1096.0590 1097.3776 1105.3691 1113.2935 1114.6228 1121.3011 1142.4863 1156.0217 1176.3095 1208.3623 1274.1401 1277.2408 1301.9860 1326.4587 1335.8088 1346.1859 1373.7236 1377.9872 1381.9699 1394.0964 1435.7585 1452.0315 1456.4880 1463.1889 1465.0818 1470.8872 1476.9168 1479.1383 1481.0950 1483.7112 1488.9635 1637.2456 2905.1733 2930.5076 2983.0734 2983.9834 2987.0913 3005.2990 3008.6783 3011.5571 3032.2239 3063.5083 3079.4431 3082.0298 3084.6748 3088.3350 3088.4785 3096.7116 3098.0316 3099.0848
redmass: 2.8499 4.3149 4.2583 2.8742 2.5235 2.5763 2.8387 2.1923 1.0445 1.0647 2.2462 1.2032 1.7481 3.5635 2.7707 3.1927 2.9903 2.9525 3.0022 2.6268 3.3576 3.2256 6.0973 2.1498 1.4165 4.2963 3.9627 1.7494 1.1848 3.2470 1.5316 1.4345 3.6574 4.1779 1.6130 1.9952 2.6772 1.3582 2.7628 2.3804 1.9483 1.3550 1.8676 1.4084 1.1381 1.2870 1.3331 1.2452 1.4168 1.5757 1.2848 1.4385 1.2764 1.2244 1.1319 1.0852 1.0561 1.0454 1.0580 1.0485 1.0488 1.0545 1.0543 1.0750 1.0617 9.3358 1.0832 1.0351 1.0342 1.0363 1.0352 1.0609 1.0976 1.0629 1.0852 1.1004 1.0986 1.1007 1.1002 1.1009 1.1005 1.0996 1.1051 1.0976
irintensity: 0.4155 1.6224 0.1968 4.2264 3.5052 0.5698 0.8140 1.3672 0.5787 0.4871 0.3555 1.3653 6.1788 6.6881 5.6782 8.3864 0.5364 15.0993 1.6487 1.6069 2.4083 0.5598 3.6505 5.5055 6.0906 9.0617 17.8050 8.8129 5.5081 15.9340 1.8733 0.7383 25.6197 79.2517 32.0667 85.0709 218.7149 10.2957 140.4824 22.2111 26.1487 7.1592 9.5019 2.1821 0.2057 0.8500 4.6182 12.6476 18.0954 41.0546 17.8858 19.1539 9.6705 26.1448 2.7343 2.0044 13.1274 6.6895 5.6091 1.7794 18.8278 12.0944 7.8945 9.5604 25.1951 162.3307 55.5195 84.4310 29.6904 15.6101 28.4655 7.8526 61.4332 45.2600 6.5437 4.8855 38.3437 17.2650 36.2630 24.3474 23.6503 43.2504 35.2609 37.5171
temp: 298.150 k
press: 1.00000 atm
elementType: 8 8 8 6 6 6 6 6 6 6 6 6 1 1 1 1 1 1 1 1 1 1 1 1 1 1 1 1 1 1
symmnumber: 1
zpe: 677085.0 jmol-1
zpe.correction: 0.257888 hartree
zpe.thermalcorrener: 0.272748 hartree
zpe.thermalcorrenthalpy: 0.273692 hartree
zpe.thermalcorrgfe: 0.214774 hartree
zpe.sumelectzpe: -578.422048 hartree
zpe.sumelectthermal: -578.407188 hartree
zpe.sumelectthermalent: -578.406244 hartree
zpe.sumelectthermalfe: -578.465162 hartree
dipole: 2.0266 -1.8222 -0.1418
dipole: 2.7291
quadrupole: -60.1483 -76.1545 -75.4304
quadrupole: 4.9424 -6.8825 2.4974
quadrupole: 10.4294 -5.5768 -4.8527 4.9424 -6.8825 2.4974
hfenergy: -578.679936 hartree
pointgroup: C01 [X(C9H18O3)]
dipole: -0.7919224 -0.6675817 0.2828932 debye
polarizability: 136.0187861|-0.1355074|101.1050287|-0.4846862|-1.422991|91.2651065 unknown
InChI: InChI=1S/C9H18O3/c1-7(2)9(10)12-6-5-8(3)11-4/h7-8H,5-6H2,1-4H3
charge 0 multiplicity 1
30 atoms
O  0.868836 -0.530787 0.053148
O  -3.147063 0.525972 -0.71551
O  1.934103 1.510494 0.413791
C  -1.510707 -0.957693 0.224322
C  -2.929292 -0.393293 0.423319
C  -0.452003 0.144694 0.241641
C  3.273731 -0.50092 -0.142417
C  -3.993472 -1.505174 0.480663
C  1.998936 0.286861 0.149768
C  3.6953 -0.232377 -1.614912
C  4.392754 -0.097545 0.844596
C  -4.312726 1.394936 -0.568852
H  -1.295389 -1.692474 1.022617
H  -1.472352 -1.491814 -0.74301
H  -2.965128 0.202299 1.367385
H  -0.606091 0.869105 -0.574946
H  -0.43092 0.695743 1.200695
H  3.036107 -1.574397 -0.033319
H  -3.783352 -2.195518 1.3183
H  -3.990399 -2.085724 -0.459286
H  -5.007468 -1.094562 0.632639
H  4.604594 -0.812004 -1.855621
H  3.916928 0.839832 -1.763016
H  2.899666 -0.526882 -2.322259
H  5.329534 -0.627218 0.594087
H  4.123513 -0.346442 1.886849
H  4.575911 0.98986 0.790896
H  -5.267508 0.833452 -0.629349
H  -4.264556 2.11017 -1.405428
H  -4.284585 1.952905 0.392107
