program: Gaussian 09
title: 000095467
version: EM64L-G09RevD.01
frameworkgroup: C1[X(C6H12O5)]
method: RPBEPBE
basis: SDD
operation: Freq
keyword: #pfreq=noraman
keyword: PBEPBE/SDD
title: #p freq=noraman PBEPBE/SDD
converged: YES YES NO NO
title: Mulliken charges:
elementType: O O O O O C C C C C C H H H H H H H H H H H H
charge: -0.278990 -0.434643 -0.414233 -0.446860 -0.246205 -0.086178 -0.292792 -0.318210 -0.131208 0.228289 -0.660524 0.198857 0.250042 0.232011 0.176151 0.244496 0.243508 0.215322 0.253186 0.224119 0.353200 0.330079 0.360582
chargesum: 0.00000
title: Mulliken charges with hydrogens summed into heavy atoms:
elementType: O O O O O C C C C C C
charge: -0.278990 -0.081443 -0.084154 -0.086277 -0.246205 0.112678 0.189261 0.102438 0.112301 0.228289 0.032103
polarizability: 1.06164193e+02 -5.21370230e-03 7.90080330e+01 -5.72428771e-01 3.53492465e+00 6.57127713e+01
1716.lowfreq: -12.2180 -3.6401 -0.0001 0.0008 0.0010 1.6367 20.6271 41.2319 51.1839
frequency: 20.0797 41.1614 51.1658 76.1914 79.9898 146.8804 189.7474 214.9900 227.5950 248.4536 281.3597 293.2643 305.2154 340.3383 391.7422 400.9084 450.4638 497.8054 516.8855 644.0542 706.4491 811.1459 850.2533 876.0689 912.1409 920.7761 973.7940 1015.9839 1038.4116 1060.1079 1067.7299 1092.7514 1100.0856 1154.0096 1159.2569 1209.8385 1243.4820 1258.1020 1282.6724 1303.3758 1336.3976 1356.7066 1371.6350 1377.8355 1385.0733 1401.1609 1444.8748 1455.3108 1461.6812 1472.3813 1626.7074 2928.1780 2944.2559 2993.7315 3017.9394 3040.6609 3088.7285 3095.5915 3096.7486 3109.4012 3493.0191 3550.5496 3558.1203
redmass: 4.1117 4.5952 6.0262 4.8994 2.7919 3.0990 2.9710 2.2930 1.3504 1.8191 2.2137 4.0129 2.1287 2.0665 1.6000 1.7907 2.1621 4.0742 3.1767 5.0883 3.8724 3.7284 3.3532 4.4570 1.8463 2.6648 3.4893 2.0219 2.9345 2.0287 2.6642 2.1784 3.2982 1.3022 2.0122 1.1356 1.5040 1.1501 1.2699 1.2813 1.2639 1.2604 1.2908 1.2582 1.3076 1.4614 1.0826 1.0827 1.0637 1.0525 10.2157 1.0834 1.0697 1.0348 1.0567 1.0854 1.1008 1.1007 1.1005 1.1005 1.0652 1.0655 1.0663
irintensity: 6.8818 1.2025 5.0876 1.9708 6.4718 11.4720 4.8351 33.2487 10.7363 79.4343 67.6150 15.1693 59.6901 84.3489 128.6782 62.5518 34.5459 9.8085 19.8925 15.5185 7.2100 6.0410 18.4156 29.9512 1.8777 56.0532 40.3069 39.7577 137.3535 62.5828 34.7901 168.4717 42.4122 122.9808 95.4468 2.6098 95.7802 25.1891 24.8355 1.1003 6.8678 3.2224 38.0247 5.2070 15.1393 5.0541 4.6915 10.1816 15.4246 16.0070 173.3416 56.3602 67.0173 14.4841 16.0842 13.1168 0.5467 31.3248 34.5095 17.4413 20.8172 6.6106 7.5630
temp: 298.150 k
press: 1.00000 atm
elementType: 8 8 8 8 8 6 6 6 6 6 6 1 1 1 1 1 1 1 1 1 1 1 1
symmnumber: 1
zpe: 478873.6 jmol-1
zpe.correction: 0.182393 hartree
zpe.thermalcorrener: 0.196068 hartree
zpe.thermalcorrenthalpy: 0.197013 hartree
zpe.thermalcorrgfe: 0.140308 hartree
zpe.sumelectzpe: -611.021221 hartree
zpe.sumelectthermal: -611.007546 hartree
zpe.sumelectthermalent: -611.006602 hartree
zpe.sumelectthermalfe: -611.063307 hartree
dipole: 0.2539 -0.4156 1.0995
dipole: 1.2026
quadrupole: -89.9173 -67.0389 -62.5600
quadrupole: 12.5164 -9.9335 0.5304
quadrupole: -16.7452 6.1332 10.6120 12.5164 -9.9335 0.5304
hfenergy: -611.2036146 hartree
pointgroup: C01 [X(C6H12O5)]
dipole: -0.1157928 0.1438342 0.4356115 debye
dipolederiv: -1.7852442 0.0938574 -0.1050131 0.162518 -0.439335 0.0917272 -0.0911882 0.0990658 -0.3056693 -0.3522189 0.0300573 -0.1795522 0.0874424 -0.7843715 -0.0526294 -0.1940132 -0.0514537 -0.4748906 -0.8125344 -0.0394392 -0.2222651 -0.0510436 -0.5336842 0.1139393 -0.2971641 0.1212041 -0.2451888 -0.7211182 0.1860503 -0.0283323 0.1109214 -0.5565148 -0.1964954 -0.0454166 -0.1802771 -0.3861048 -0.7618473 -0.0301412 0.0056255 0.3271931 -0.7896324 0.1783157 -0.1634685 0.2498433 -0.3771462 0.1170089 0.0057983 0.0300001 -0.0511971 0.5673197 0.1527786 0.160641 0.1045179 0.3939728 0.7120869 0.1227501 -0.0436992 0.1939674 0.1508528 0.0251595 -0.1176612 0.0415222 0.2740204 0.6162944 -0.1115397 0.1789799 0.0190157 0.389475 -0.069954 0.1930294 -0.0408976 0.3110753 0.3701201 -0.2538513 0.0058677 -0.3216581 0.2818476 0.1414894 0.0136815 0.0913943 0.3221999 1.6616501 -0.0020141 0.1054937 -0.5089534 0.9282027 -0.3217469 0.2796032 -0.4012698 0.3070316 -0.042588 -0.065583 0.0008398 0.0324818 -0.0534016 -0.0924717 0.1070443 -0.0499419 -0.0213868 0.030008 0.0094717 0.003373 -0.0039553 -0.0261078 -0.0242256 -0.0362556 -0.0482897 -0.2264473 -0.0200364 -0.0104767 -0.0140391 -0.0629131 0.0709459 -0.0061371 0.0267707 0.0315244 -0.0831554 -0.0129187 0.0305551 0.0199132 -0.0567281 -0.0766226 -0.0598589 0.0247669 -0.0711507 0.0409009 -0.0221723 0.0792873 -0.0373551 0.0768635 -0.2232506 0.0125443 -0.0278326 -0.0488607 0.0554175 0.0521722 0.0049674 -0.0012465 0.0155288 0.0933899 -0.0358396 -0.0036256 0.0058738 -0.0903772 0.0186407 0.0368474 -0.0416751 0.0433375 0.0376501 0.0262062 -0.0650219 0.038619 -0.0817684 -0.0625715 0.1381265 -0.0055414 0.1223217 0.0140528 -0.0206171 -0.0141619 -0.0014399 0.0830494 -0.0299891 -0.1174305 0.037711 -0.1187389 0.0080128 0.0129948 0.0336804 0.0076362 0.0789097 0.1086875 0.0010545 -0.0240114 0.0277907 0.0396816 0.091457 -0.0349193 0.0288126 -0.1034247 0.1560155 -0.1286564 0.1110673 -0.1565092 0.3170443 -0.0187255 0.1317018 -0.0160497 0.292717 0.3245216 0.0681872 0.1421731 0.0848099 0.3395184 -0.0450247 0.0955831 -0.0367412 0.02115 0.4560328 -0.0478782 0.0616864 0.027505 0.2449269 0.0971142 0.0242266 0.1263585 0.2151152 unknown
polarizability: 106.0723511|1.0564707|79.2832589|1.6538754|-2.9948257|65.5293871 unknown
InChI: InChI=1S/C6H12O5/c1-4(8)6(10)11-3-5(9)2-7/h4-5,7-9H,2-3H2,1H3
charge 0 multiplicity 1
23 atoms
O  -0.304622 -0.13868 0.263249
O  2.118288 -1.45367 -0.292412
O  4.597854 0.093854 0.534489
O  -3.935425 0.228862 0.51707
O  -1.735517 1.520941 -0.531158
C  2.105465 -0.112657 0.294077
C  0.875988 0.67092 -0.181193
C  3.401403 0.594862 -0.139064
C  -2.692643 -0.530092 0.435325
C  -1.555589 0.404097 0.009844
C  -2.819242 -1.716554 -0.550053
H  2.066461 -0.176531 1.406625
H  0.843574 0.755309 -1.281995
H  0.805846 1.677324 0.269112
H  3.290129 1.691874 0.012792
H  3.577772 0.395308 -1.208273
H  -2.48302 -0.911241 1.45035
H  -1.919985 -2.357309 -0.523058
H  -3.695975 -2.318136 -0.258859
H  -2.973355 -1.356869 -1.58278
H  1.272078 -1.907838 -0.043831
H  4.480452 0.170004 1.515393
H  -3.854938 1.018522 -0.084151
