program: Gaussian 09
title: 000095454
version: EM64L-G09RevD.01
frameworkgroup: C1[X(C6H14O2S)]
method: RPBEPBE
basis: SDD
operation: Freq
keyword: #p
keyword: freq=noraman
keyword: PBEPBE/SDD
title: #p freq=noraman PBEPBE/SDD
converged: YES YES NO NO
title: Mulliken charges:
elementType: S O O C C C C C C H H H H H H H H H H H H H H
charge: 0.234710 -0.427263 -0.427265 -0.035391 -0.035411 -0.674781 -0.674793 -0.681775 -0.681769 0.231782 0.231788 0.247160 0.237767 0.247184 0.237749 0.209121 0.200458 0.246796 0.209120 0.200456 0.246798 0.328776 0.328780
chargesum: 0.00000
title: Mulliken charges with hydrogens summed into heavy atoms:
elementType: S O O C C C C C C
charge: 0.234710 -0.098487 -0.098484 0.196390 0.196377 -0.189854 -0.189860 -0.025399 -0.025394
polarizability: 1.21256823e+02 1.36734523e-03 8.28787720e+01 5.26063881e-03 1.95535143e-03 7.33168932e+01
1716.lowfreq: -23.9847 -8.8386 -2.7222 -0.0020 -0.0010 0.0016 23.7448 32.1448 67.8405
frequency: 23.2510 32.0879 67.8392 98.8042 101.1216 188.5360 190.6403 210.5232 210.6455 268.5731 277.0490 307.0829 340.4026 434.8871 435.0291 450.2276 451.4190 697.2961 725.6611 801.0088 814.0459 871.8386 882.6730 925.0332 928.6611 1000.3011 1006.8951 1059.2967 1071.5654 1101.3224 1102.8328 1146.3412 1150.9077 1227.7735 1259.1788 1285.4509 1285.7761 1315.9715 1323.8583 1383.3245 1383.6321 1385.4101 1385.6673 1438.3059 1441.8023 1464.8075 1464.9955 1471.3257 1471.3703 2974.4746 2974.6940 2981.2328 2981.8565 3043.5401 3045.1198 3055.3619 3059.0228 3077.4503 3078.3451 3095.4941 3095.5555 3546.6539 3546.7784
redmass: 4.4033 3.4049 3.9762 3.7481 2.6439 5.0337 3.7431 1.0660 1.0604 1.0689 1.0930 3.3850 3.7335 3.5409 2.5933 2.0086 3.1537 4.5372 4.8516 3.6195 3.5059 1.4296 1.3997 1.9146 1.8136 1.4593 1.5276 2.4012 2.5441 1.1326 1.1560 1.8914 2.0756 1.2310 1.2232 1.4943 1.5110 1.3727 1.4087 1.1853 1.1880 1.1695 1.1728 1.0980 1.1019 1.0531 1.0529 1.0498 1.0499 1.0396 1.0384 1.0556 1.0570 1.0914 1.0888 1.1006 1.1029 1.0971 1.0979 1.0992 1.0991 1.0659 1.0659
irintensity: 2.5401 0.3396 0.1816 1.4085 0.0824 0.0904 0.8213 17.4060 2.4713 314.7418 4.0559 0.0831 13.2090 1.4879 23.0718 5.6239 28.2200 2.2827 0.2145 9.9841 16.5492 1.3120 8.7455 10.0090 5.3155 49.3530 66.6951 2.5598 2.9645 79.0364 40.9565 55.8248 6.4847 20.3929 0.5374 10.7288 16.1005 0.6541 0.0001 3.0673 44.7049 40.8470 0.2337 6.6140 3.0846 20.1654 2.1901 17.8615 2.9296 4.7932 12.4947 65.7121 25.3105 2.3058 6.9731 4.2538 0.1964 141.4218 3.6002 33.1724 20.8140 3.2233 8.5727
temp: 298.150 k
press: 1.00000 atm
elementType: 16 8 8 6 6 6 6 6 6 1 1 1 1 1 1 1 1 1 1 1 1 1 1
symmnumber: 1
zpe: 507922.6 jmol-1
zpe.correction: 0.193458 hartree
zpe.thermalcorrener: 0.206284 hartree
zpe.thermalcorrenthalpy: 0.207228 hartree
zpe.thermalcorrgfe: 0.152824 hartree
zpe.sumelectzpe: -784.754841 hartree
zpe.sumelectthermal: -784.742014 hartree
zpe.sumelectthermalent: -784.741070 hartree
zpe.sumelectthermalfe: -784.795474 hartree
dipole: -0.0005 5.2704 -0.0005
dipole: 5.2704
quadrupole: -62.5863 -70.9919 -57.2151
quadrupole: 0.0009 3.4055 0.0032
quadrupole: 1.0114 -7.3941 6.3827 0.0009 3.4055 0.0032
hfenergy: -784.9482983 hartree
pointgroup: C01 [X(C6H14O2S1)]
dipole: -0.0008715 -2.0735509 0.0000877 debye
dipolederiv: -0.2151329 0.0001122 -0.0272816 0.0000658 0.0632282 0.0000569 -0.0794235 -0.0000091 -0.1664443 -0.8131938 0.0569889 0.026268 0.022169 -0.5572859 -0.2898701 0.0322491 -0.3117787 -0.298735 -0.813211 -0.0566108 0.0266993 -0.0217621 -0.557078 0.2899257 0.0327981 0.311856 -0.2989638 0.5439827 -0.001663 -0.0188615 -0.1663366 0.4604326 0.1908746 0.0634715 0.2213617 0.3886225 0.5440374 0.001436 -0.0190377 0.1661305 0.4601865 -0.1909233 0.0632377 -0.2214005 0.3887674 0.1494032 0.1893948 -0.0248907 0.2618644 -0.0160031 -0.0542147 -0.071737 -0.0136638 0.1292735 0.149115 -0.1894975 -0.0248279 -0.2619407 -0.0156483 0.0542286 -0.0716954 0.0137513 0.1292707 -0.2388915 -0.1326871 -0.0272646 0.0174647 -0.0553424 -0.0453334 -0.0175669 -0.0253313 0.0835965 -0.2388451 0.1327983 -0.0271327 -0.0173648 -0.0553522 0.0453529 -0.0173517 0.0252959 0.0836019 0.0586204 -0.0169411 0.0370184 0.0074798 0.0002128 0.0627049 0.0073416 0.0272827 -0.1029439 0.0586687 0.0169207 0.0369033 -0.0075437 0.0001933 -0.0627511 0.0072425 -0.0273183 -0.1029378 -0.01288 0.0181587 0.0333223 -0.0282797 -0.0820631 -0.1002289 0.0206491 -0.1086612 -0.0065832 -0.0471744 -0.0515158 0.0423962 -0.0907492 -0.0120221 0.0871812 0.0274978 0.1067259 -0.1037153 -0.0128606 -0.0181467 0.033391 0.0283064 -0.0820791 0.1002323 0.0207229 0.1086652 -0.0066295 -0.047036 0.0514728 0.0422587 0.0907376 -0.0121411 -0.0872544 0.0273405 -0.1067692 -0.1037272 0.102964 0.0307544 0.0431447 -0.0041264 -0.0667916 -0.1263428 0.0194842 -0.1312972 -0.0124796 0.0914175 -0.008513 -0.0292004 -0.0319593 0.0459768 0.0644796 0.041684 0.1028353 -0.141712 -0.1464798 0.0490864 -0.048523 0.0781472 0.0503734 0.0332586 -0.0449358 0.0276046 0.092385 0.1029885 -0.0307483 0.043157 0.0041308 -0.0667052 0.1263433 0.0194783 0.1313281 -0.0126108 0.0914495 0.0084149 -0.0293746 0.031907 0.0459045 -0.0645434 0.0414719 -0.1029233 -0.1416526 -0.1465838 -0.0490012 -0.048399 -0.0780703 0.0504194 -0.0331659 -0.0447833 -0.0275382 0.0924592 0.4198305 0.0040814 -0.0197169 -0.0085572 0.2008342 0.1763301 -0.0384131 0.1087589 0.0555249 0.4198114 -0.0042953 -0.0200483 0.0082867 0.2007503 -0.1763408 -0.0387625 -0.1087748 0.0556331 unknown
polarizability: 121.2413953|-0.0140838|82.8787768|0.8597341|0.0022067|73.332316 unknown
InChI: InChI=1S/C6H14O2S/c1-5(7)3-9-4-6(2)8/h5-8H,3-4H2,1-2H3
charge 0 multiplicity 1
23 atoms
S  -0.000343 0.650685 0.000751
O  -3.018396 1.246433 0.455452
O  3.01771 1.244338 -0.455899
C  -2.744363 0.055658 -0.373288
C  2.743455 0.053947 0.373344
C  -1.415875 -0.614819 0.017283
C  1.414376 -0.615785 -0.0164
C  -3.922733 -0.937105 -0.319204
C  3.92125 -0.939479 0.318836
H  -2.6524 0.478272 -1.389015
H  2.652285 0.476859 1.389019
H  -1.17106 -1.410441 -0.709859
H  -1.481769 -1.065112 1.027124
H  1.16933 -1.41109 0.711005
H  1.479478 -1.066321 -1.026178
H  -3.783402 -1.768295 -1.035285
H  -4.032264 -1.371959 0.693354
H  -4.85899 -0.411428 -0.572978
H  3.781907 -1.770353 1.035284
H  4.029929 -1.374726 -0.693644
H  4.857933 -0.414211 0.571875
H  -3.009283 0.982224 1.41153
H  3.007726 0.979907 -1.411909
