program: Gaussian 09
title: 000095459
version: EM64L-G09RevD.01
frameworkgroup: C1[X(C10H10O4)]
method: RPBEPBE
basis: SDD
operation: Freq
keyword: #pfreq=noraman
keyword: PBEPBE/SDD
title: #p freq=noraman PBEPBE/SDD
converged: YES YES NO NO
title: Mulliken charges:
elementType: O O O O C C C C C C C C C C H H H H H H H H H H
charge: -0.426748 -0.202816 -0.407992 -0.238921 -0.321043 0.492634 -0.525618 -0.420107 -0.364959 0.131998 0.209389 -0.227688 -0.241080 -0.239321 0.290534 0.268062 0.289632 0.248756 0.239442 0.227478 0.225373 0.228619 0.383655 0.380721
chargesum: 0.00000
title: Mulliken charges with hydrogens summed into heavy atoms:
elementType: O O O O C C C C C C C C C C
charge: -0.043093 -0.202816 -0.027271 -0.238921 -0.030508 0.492634 0.032076 -0.171350 -0.125517 0.131998 0.209389 -0.000211 -0.015707 -0.010701
polarizability: 1.33843622e+02 -9.24800339e+00 1.05548537e+02 3.86685311e+00 1.45931678e+01 9.89518197e+01
1716.lowfreq: -9.4430 -7.3990 -0.7917 -0.0012 -0.0008 -0.0007 21.5641 38.1789 40.3614
frequency: 21.4738 38.1595 40.3458 55.3311 105.4481 132.4271 180.8551 217.2488 287.9036 319.1057 347.0848 403.4292 429.6862 503.1889 513.5595 562.1763 582.5294 596.4014 616.7185 634.1974 654.6117 686.5090 703.2564 764.2899 792.2634 849.1471 850.7073 912.3934 922.8025 960.5369 973.8832 992.0262 995.1389 1026.4102 1036.7782 1049.8399 1072.3249 1089.5050 1173.3154 1179.1892 1193.7160 1203.4545 1228.8759 1262.9041 1287.0332 1310.7602 1349.6305 1359.2129 1386.0023 1440.2590 1444.1982 1486.7411 1595.0969 1616.4124 1663.2233 1669.4586 3001.6491 3011.0114 3086.6304 3123.7244 3129.9716 3141.2658 3151.0499 3165.3887 3512.0167 3519.3822
redmass: 9.0089 4.5554 6.3856 9.5383 4.8561 5.6626 3.6139 6.1353 3.9739 6.5249 6.2968 2.7910 3.9788 2.0513 3.2428 3.7924 2.8221 1.7657 5.9179 2.4112 1.8253 3.5059 1.6779 1.9869 3.6677 1.8727 2.1440 2.5483 1.8346 2.6980 1.4235 5.7270 1.3220 2.7164 3.1466 2.2048 2.1074 1.7832 1.0569 1.2304 1.1200 1.6940 1.3977 1.5932 1.5766 1.8026 1.5111 1.8665 6.2125 1.1315 2.0265 2.3286 6.0476 6.1039 8.5606 9.0808 1.0806 1.0630 1.0985 1.0846 1.0879 1.0924 1.0966 1.1017 1.0639 1.0642
irintensity: 0.7619 0.2070 0.5000 1.7652 3.0599 1.2484 1.0956 0.4812 0.6288 4.3874 4.5475 0.2541 4.4365 19.5436 5.5795 88.8065 73.2854 92.0756 4.0989 46.7811 97.4512 19.9443 61.8773 36.6400 0.3954 0.5989 2.5351 16.3585 1.5741 114.1761 0.7475 6.5228 0.0791 21.0124 121.5989 218.9964 125.4920 37.7259 0.2675 4.3826 0.1097 3.2654 16.3416 16.2603 54.3240 13.7688 7.2508 38.1274 0.7759 38.6177 4.8942 15.2685 1.1884 1.1569 201.0356 196.1539 8.1177 11.6106 4.2709 1.4056 0.9188 23.1964 33.0212 15.6833 26.3591 28.2507
temp: 298.150 k
press: 1.00000 atm
elementType: 8 8 8 8 6 6 6 6 6 6 6 6 6 6 1 1 1 1 1 1 1 1 1 1
symmnumber: 1
zpe: 476181.1 jmol-1
zpe.correction: 0.181368 hartree
zpe.thermalcorrener: 0.194434 hartree
zpe.thermalcorrenthalpy: 0.195379 hartree
zpe.thermalcorrgfe: 0.139092 hartree
zpe.sumelectzpe: -686.952605 hartree
zpe.sumelectthermal: -686.939539 hartree
zpe.sumelectthermalent: -686.938595 hartree
zpe.sumelectthermalfe: -686.994881 hartree
dipole: -1.2637 -0.7712 1.0752
dipole: 1.8297
quadrupole: -72.4268 -77.8434 -81.1470
quadrupole: -7.0684 -1.0899 -1.1351
quadrupole: 4.7123 -0.7043 -4.0080 -7.0684 -1.0899 -1.1351
hfenergy: -687.1339731 hartree
pointgroup: C01 [X(C10H10O4)]
dipole: -0.543655 0.3953325 -0.2575978 debye
dipolederiv: -1.234181 -0.3212644 0.1252209 -0.4034854 -0.4874752 0.1185154 0.1021136 0.1049982 -0.3833462 -0.7601491 -0.0402116 0.1101821 0.1632979 -0.7515873 -0.2469237 0.283093 -0.2143541 -0.4261401 -0.5328762 0.2432729 -0.1136152 0.3891072 -1.038321 0.3794693 -0.1302364 0.3430707 -0.4022926 -0.4206077 0.1311509 -0.0364646 0.1540774 -0.6294733 -0.1332746 -0.1581344 0.1329749 -0.8808193 0.1369015 0.0483383 0.0192387 0.0197511 -0.1514994 -0.1053684 -0.0704233 -0.2391644 0.0344998 0.2230981 0.0964499 -0.0070432 0.0845196 -0.0956638 -0.0070889 -0.0245647 -0.0074333 -0.024357 -0.0002752 -0.151422 -0.1003478 -0.0234057 -0.205191 -0.1533173 -0.0071386 -0.2306152 -0.0882012 -0.0867335 -0.0042104 -0.0824417 -0.0100203 -0.1351738 0.0256238 -0.0453446 0.0274275 0.0294051 -0.090548 0.0451839 0.0553408 0.0848613 -0.0515209 0.0791905 0.0676475 0.0517098 0.006277 1.4766122 0.3082735 -0.2936204 0.2331436 1.1609439 0.3135479 -0.3673383 0.4094985 0.4292707 0.4120134 -0.3130413 0.2199514 -0.5682748 1.4228693 -0.0505315 0.2611392 -0.1839883 1.1319258 -0.0282983 0.0603187 0.084038 0.0641396 -0.1156687 0.0677557 0.0793512 0.0521191 0.0566477 -0.0450211 0.0166864 -0.0937291 0.0127937 -0.1439338 0.0186417 -0.0906933 0.010849 0.0979721 0.0653495 0.0860387 -0.0224589 0.079091 -0.1280548 0.0061738 -0.0119571 0.0186845 -0.0536533 0.0678268 -0.0403499 -0.0084921 -0.0394034 0.1142983 0.0078582 0.0307251 0.0906827 -0.0039876 0.1155916 0.0298069 0.0735947 0.0070198 0.0403779 0.0290276 0.0401131 0.0512738 -0.0219206 -0.0814494 -0.0036292 0.0080373 0.001144 0.1300524 -0.0075213 0.0073899 -0.0152031 0.1044161 0.062165 -0.0248661 0.0985938 -0.0267339 0.1394162 -0.0087201 0.0830691 -0.0069017 -0.0265298 0.0424003 -0.0453981 -0.0822056 -0.0463061 0.1090414 -0.0575474 -0.0932025 -0.0478407 -0.0003312 0.0246555 -0.0568232 -0.0763358 -0.0666277 0.1241705 -0.0624204 -0.0923555 -0.0639977 -0.0462885 0.0405784 -0.0259552 0.0806653 -0.0237656 0.1433646 -0.0135507 0.0974257 -0.0076731 -0.0854445 -0.1083618 -0.0886783 0.0261563 -0.0923271 0.1270792 -0.0024383 0.0282965 -0.0028381 0.0894723 0.3298067 0.0602711 0.0407793 0.0042534 0.1572214 -0.1066593 0.0124277 -0.1374504 0.3099428 0.3915024 -0.0099415 -0.0250444 0.0031503 0.2647279 -0.090442 -0.0014029 -0.1358285 0.1534825 unknown
polarizability: 132.2142136|13.1250624|97.1955071|-3.466798|12.4526987|108.934258 unknown
InChI: InChI=1S/C10H10O4/c11-9(12)6-8(10(13)14)7-4-2-1-3-5-7/h1-5,8,11,13H,6H2
charge 0 multiplicity 1
24 atoms
O  -2.436617 -2.412609 -0.111294
O  -0.35014 -2.807247 -1.038566
O  -2.302459 2.720647 -0.081938
O  -1.614327 1.599478 1.830514
C  -0.790593 -0.685807 0.219998
C  0.661808 -0.254152 0.036945
C  -1.793401 0.381785 -0.31805
C  1.402247 0.199737 1.156132
C  1.274255 -0.242912 -1.242447
C  -1.104381 -2.051801 -0.394458
C  -1.864789 1.583722 0.605545
C  2.732048 0.654262 1.003961
C  2.601986 0.210477 -1.395718
C  3.336091 0.660832 -0.273368
H  -1.003174 -0.786467 1.30299
H  -1.523281 0.717583 -1.332873
H  -2.811164 -0.050331 -0.368085
H  0.929858 0.210202 2.145312
H  0.725879 -0.611906 -2.116049
H  3.29174 1.002131 1.879288
H  3.067056 0.206319 -2.38789
H  4.367521 1.010594 -0.394229
H  -2.615909 -3.316394 -0.487529
H  -2.374554 3.483455 0.55451
