program: Gaussian 09
title: 000095423
version: EM64L-G09RevD.01
frameworkgroup: C1[X(C7H15N)]
method: RPBEPBE
basis: SDD
operation: Freq
keyword: #pfreq=noraman
keyword: PBEPBE/SDD
title: #p freq=noraman PBEPBE/SDD
converged: NO YES NO NO
title: Mulliken charges:
elementType: N C C C C C C C H H H H H H H H H H H H H H H
charge: -0.307705 -0.019556 -0.398099 -0.032707 -0.371544 -0.438164 -0.734189 -0.741982 0.189955 0.196536 0.181853 0.177896 0.201691 0.185617 0.172829 0.209168 0.252563 0.210645 0.210660 0.210908 0.204011 0.228605 0.211010
chargesum: 0.00000
title: Mulliken charges with hydrogens summed into heavy atoms:
elementType: N C C C C C C C
charge: -0.055142 0.170399 -0.019710 0.145189 0.015764 -0.056166 -0.101976 -0.098356
polarizability: 9.13317611e+01 9.70123903e-01 8.34300429e+01 2.83809643e-02 -2.14804061e-01 6.81152906e+01
1716.lowfreq: -20.8995 -0.0005 -0.0005 -0.0004 16.8624 23.9409 145.9184 148.0065 216.1655
frequency: 145.9123 147.9771 216.1458 222.5837 241.6969 282.7297 336.8753 401.7611 419.2117 440.0969 476.0489 542.8292 668.3122 788.8944 833.0688 848.2991 880.8007 939.4172 954.9875 965.6152 995.7527 1018.7789 1051.3350 1104.1238 1120.9118 1137.6172 1153.5643 1165.3182 1195.8670 1239.9705 1264.2064 1273.4739 1300.9458 1311.7359 1329.4168 1337.8651 1355.9242 1371.8384 1381.1470 1384.2790 1438.0405 1446.3983 1451.7653 1470.3519 1472.0690 1473.3291 1477.4377 1478.3453 2813.2192 2839.9040 2939.1312 2964.7764 2968.4137 2972.7671 2977.1888 3027.7403 3032.0430 3041.1148 3061.8914 3063.2294 3063.7514 3085.5981 3429.2962
redmass: 2.3767 2.2722 1.0460 1.0546 2.4170 1.8463 2.4105 3.3091 3.4637 2.0588 2.0845 1.6982 1.8541 1.9398 2.1086 1.5068 1.9142 1.8091 1.5508 1.4318 1.6721 1.3869 2.5042 2.0407 1.7356 2.5377 2.1993 1.4696 2.3112 1.2820 1.2718 1.2783 1.2969 1.2671 1.3772 1.4248 1.7252 1.4368 1.2463 1.2260 1.1509 1.1981 1.0969 1.0790 1.1028 1.0464 1.0568 1.0638 1.0805 1.0708 1.0820 1.0379 1.0545 1.0389 1.0587 1.0884 1.1025 1.1030 1.0992 1.0987 1.0983 1.0999 1.0747
irintensity: 0.5582 0.1676 0.0809 0.2021 0.3910 2.3048 2.1750 3.9835 2.0613 0.1999 8.7865 41.9361 72.7920 3.1189 1.5712 3.5968 0.0436 0.4711 2.0918 3.6773 6.1367 2.0268 6.0311 8.8217 8.2685 11.8537 1.6809 2.4942 15.1032 3.6804 3.0775 0.9669 10.2291 31.1779 1.5705 3.4347 10.9598 10.3933 16.6662 8.3623 9.4364 1.3766 9.4554 7.3902 6.4802 19.7026 6.4452 4.2793 77.7593 139.9502 26.6268 25.3148 43.3097 58.5986 36.2110 70.2409 14.4360 43.9554 74.5393 29.4184 60.8399 41.6928 4.4086
temp: 298.150 k
press: 1.00000 atm
elementType: 7 6 6 6 6 6 6 6 1 1 1 1 1 1 1 1 1 1 1 1 1 1 1
symmnumber: 1
zpe: 551688.6 jmol-1
zpe.correction: 0.210127 hartree
zpe.thermalcorrener: 0.218864 hartree
zpe.thermalcorrenthalpy: 0.219808 hartree
zpe.thermalcorrgfe: 0.177622 hartree
zpe.sumelectzpe: -329.818596 hartree
zpe.sumelectthermal: -329.809859 hartree
zpe.sumelectthermalent: -329.808915 hartree
zpe.sumelectthermalfe: -329.851101 hartree
dipole: -0.2412 0.2176 0.9763
dipole: 1.0289
quadrupole: -50.4225 -50.0904 -53.1764
quadrupole: -0.5368 -1.1228 0.5942
quadrupole: 0.8073 1.1393 -1.9467 -0.5368 -1.1228 0.5942
hfenergy: -330.0287231 hartree
pointgroup: C01 [X(C7H15N1)]
dipole: 0.092785 -0.0776102 0.3863223 debye
dipolederiv: -0.4212174 -0.1662372 0.0989752 -0.1807338 -0.5333612 -0.0376283 0.1634619 -0.0874432 -0.5839104 0.0844322 -0.0126648 -0.0164786 0.0203793 0.0799563 0.0014393 -0.0636918 0.0110434 0.1697561 -0.1041914 0.0276133 0.004849 -0.0032433 0.0500139 0.0433706 -0.0266483 0.023087 0.1218815 0.1636813 -0.0294516 0.0104203 0.0296118 0.4967235 0.1153006 0.0536184 0.0909385 0.4363231 -0.011222 0.0631998 -0.0306818 0.0769074 0.0173104 -0.0309066 -0.0192886 0.0152 0.1256352 0.398077 0.2186987 -0.1014443 0.1333339 0.2338024 -0.0689824 -0.0647741 -0.0769788 0.4185893 -0.0451308 0.0537845 -0.0354545 0.0455899 0.0274112 0.019477 -0.0053222 0.0047502 0.0924865 -0.0524923 -0.0952035 0.0321515 -0.0570297 -0.0051753 0.0221107 0.025723 0.0023374 0.0669295 0.0280874 0.0009228 -0.039517 -0.0074213 0.0182664 0.032447 0.0077927 0.0118632 -0.2139269 0.0400103 -0.0036062 -0.003314 -0.0029024 0.07327 0.0037257 0.0015183 0.066008 -0.1614123 0.0537159 -0.0020575 -0.0015721 -0.0076795 -0.1898624 -0.0765554 -0.0002653 -0.1132252 0.0320096 -0.0002478 0.0050786 0.0444305 -0.0190266 -0.0609221 0.0268549 -0.0284467 -0.0772895 -0.3148198 0.071799 0.0195469 -0.0052434 0.028525 0.0429658 0.0469856 -0.0489382 -0.0147508 -0.1716026 -0.134082 -0.1365305 0.0476601 -0.1180331 -0.0337057 0.0267482 0.0758059 0.051297 0.0530756 -0.05045 -0.0643602 0.0161587 -0.0305975 0.0137686 0.0062537 0.0669306 0.1643664 -0.2954577 0.0214684 0.0264077 0.0166949 0.0022697 -0.203557 -0.0632107 0.0260818 -0.1075726 0.0399964 -0.040168 0.072285 -0.0388162 0.0544376 0.0689542 0.0055382 -0.166255 0.0647767 0.2726775 0.0723114 0.0065559 0.0390919 0.0120386 0.0814952 -0.0022534 -0.0411339 0.0390408 -0.172114 -0.1513708 -0.0729099 0.0434252 -0.1410578 0.0215179 0.046767 0.0610395 0.0413755 0.0663318 0.07102 0.0051696 -0.0154309 0.0746942 -0.1695976 -0.0823368 0.0079635 -0.0990018 0.0473692 -0.1582784 0.0718328 -0.0501173 0.1431624 0.0188732 0.0466148 -0.0635466 0.0481307 0.063666 0.0811699 0.000346 -0.034594 -0.001106 0.0974704 -0.0034399 0.0445352 0.0432802 -0.1479132 0.0830783 0.0115801 0.0188068 -0.0521188 -0.1456183 -0.0783197 -0.0061602 -0.1012332 0.0544298 unknown
polarizability: 91.3108961|1.0489263|83.4530201|0.12878|-0.0573876|68.1131784 unknown
InChI: InChI=1S/C7H15N/c1-6-3-4-8-7(2)5-6/h6-8H,3-5H2,1-2H3
charge 0 multiplicity 1
23 atoms
N  1.243954 -0.996923 -0.244016
C  -1.302206 0.319531 0.325008
C  -0.028764 1.103035 -0.08519
C  1.264669 0.369088 0.340306
C  -1.2235 -1.12509 -0.231028
C  0.089589 -1.812969 0.197452
C  -2.587045 1.040988 -0.1335
C  2.530237 1.109139 -0.125505
H  -1.314755 0.251835 1.435988
H  -0.013588 1.224378 -1.187593
H  -0.043572 2.115226 0.366577
H  1.268479 0.325239 1.463171
H  -1.263515 -1.091446 -1.337919
H  -2.090255 -1.718574 0.121829
H  0.067541 -1.958033 1.309234
H  0.167045 -2.813595 -0.267405
H  2.141068 -1.482455 -0.103674
H  -2.611395 1.132129 -1.236657
H  -3.492587 0.487462 0.179171
H  -2.648522 2.061292 0.290014
H  3.448613 0.583587 0.201481
H  2.546027 1.174333 -1.228465
H  2.56128 2.132321 0.290723
