program: Gaussian 09
title: 000095461
version: EM64L-G09RevD.01
frameworkgroup: C1[X(C21H17N)]
method: RPBEPBE
basis: SDD
operation: Freq
keyword: #pfreq=noraman
keyword: PBEPBE/SDD
title: #p freq=noraman PBEPBE/SDD
converged: YES YES NO NO
title: Mulliken charges:
elementType: N C C C C C C C C C C C C C C C C C C C C C H H H H H H H H H H H H H H H H H
charge: -0.097291 0.203088 0.203090 0.488517 0.488526 -0.350898 -0.350899 -0.351064 -0.351063 -0.309775 -0.309772 -0.196147 -0.385057 -0.400284 -0.385059 -0.400284 -0.239175 -0.239205 -0.239175 -0.239208 -0.242316 -0.242315 0.220853 0.220852 0.263298 0.233926 0.233925 0.263295 0.235255 0.224076 0.231332 0.224074 0.231329 0.225263 0.226961 0.225263 0.226962 0.229552 0.229551
chargesum: 0.00000
title: Mulliken charges with hydrogens summed into heavy atoms:
elementType: N C C C C C C C C C C C C C C C C C C C C C
charge: -0.097291 0.203088 0.203090 0.488517 0.488526 -0.130045 -0.130047 -0.117138 -0.117138 -0.046477 -0.046476 0.039108 -0.160981 -0.168952 -0.160985 -0.168955 -0.013913 -0.012244 -0.013912 -0.012246 -0.012764 -0.012764
polarizability: 4.39821608e+02 -1.67025576e-03 3.59667033e+02 2.55564026e-01 -1.07984258e-01 8.75483937e+01
1716.lowfreq: -7.1478 -0.0004 0.0002 0.0005 2.4905 2.5373 13.8275 22.7935 28.0198
frequency: 13.7967 22.6075 28.0198 56.9020 60.8999 80.8198 97.6457 127.7936 144.9241 208.9288 231.0317 232.8115 274.6342 275.9294 296.2306 301.2505 403.0102 403.1639 444.3965 446.7016 491.4839 508.3013 512.0198 541.4251 552.2411 615.2289 615.8700 628.6991 639.1162 660.5874 694.5268 696.0760 729.9317 761.5766 771.0150 771.7459 809.7375 834.7223 844.8285 845.8797 847.9359 871.6502 894.3938 909.1550 923.4339 924.1207 956.7382 976.6753 976.6879 987.6088 987.8437 988.0379 990.7227 992.5127 1003.7816 1008.2717 1017.0020 1025.8774 1026.2661 1082.0023 1083.6035 1084.1122 1171.9762 1172.3989 1173.5710 1179.1441 1188.8102 1189.5622 1209.8228 1220.0399 1220.3076 1282.7056 1300.4060 1301.3753 1324.9600 1330.4996 1340.5856 1342.4775 1384.4939 1386.6385 1407.1795 1431.2411 1440.3885 1442.7903 1485.1302 1486.4119 1552.3445 1562.1888 1581.2549 1581.7532 1609.8093 1609.9465 1645.2138 1648.5311 3104.5992 3105.2871 3113.8467 3114.3463 3120.4550 3120.5247 3125.6989 3125.7155 3131.4246 3138.8555 3138.9046 3144.1632 3148.6970 3148.7363 3163.5164 3164.9414 3165.0748
redmass: 3.6057 3.7046 5.8141 4.7374 4.8863 4.8481 3.3895 4.4104 5.0919 6.4783 2.2394 2.3476 3.6753 6.5069 4.9233 4.5823 2.7706 2.7770 3.3287 4.5601 2.8052 4.0245 3.0811 7.1909 7.1087 6.4486 6.4187 6.6705 4.0096 5.9386 1.7358 1.6307 1.6971 1.6183 1.8811 5.5435 2.3358 4.4181 1.2830 1.2794 4.0638 1.5151 1.8387 1.6162 1.5210 1.5703 6.7506 1.3855 1.3839 1.3442 6.1548 6.1564 1.2694 1.3043 1.2202 1.1991 3.6240 2.1987 2.2534 1.6422 1.6094 1.7589 1.0763 1.0624 1.1321 2.0454 1.1342 1.1192 2.7067 1.4394 1.2711 3.0675 1.7258 1.6271 1.7078 1.3171 1.7682 2.4756 6.2343 6.7103 3.6896 2.3156 2.3413 2.4040 2.3277 2.3882 6.6142 4.9090 5.6860 5.6581 5.9228 5.9727 5.7479 5.7608 1.0926 1.0925 1.0869 1.0868 1.0859 1.0858 1.0865 1.0865 1.0865 1.0914 1.0914 1.0924 1.0961 1.0962 1.1005 1.1015 1.1015
irintensity: 0.0000 0.0094 0.0336 3.3079 0.0000 0.1876 0.0001 1.1840 0.0482 0.2072 0.0555 0.0001 0.0004 0.0182 1.5865 1.4222 0.0001 0.0488 1.5271 0.0018 0.0003 1.7020 22.9734 39.0089 12.5347 0.0307 0.1306 0.0297 0.0000 0.8886 89.7198 0.0019 51.7303 56.9722 0.0002 0.2012 69.9333 0.0980 0.0000 1.5637 0.2805 0.0000 30.0669 0.0000 0.4237 0.0001 0.3280 0.0207 1.1188 5.1833 0.1447 0.0185 0.0001 12.7470 0.0002 85.4401 0.0205 2.9099 7.2659 16.2111 9.2190 1.5985 5.5794 0.3846 31.5730 11.8557 9.5050 1.4648 7.0361 10.4505 7.7097 3.3663 7.4095 2.0876 0.4156 11.9676 5.0892 4.8764 3.4334 3.5455 6.4752 64.7656 2.0316 116.2683 11.6189 52.8751 268.0764 57.4775 0.2403 14.5815 1.8593 10.4730 46.1920 15.9565 5.5602 0.1011 40.8134 0.2654 22.6393 1.2446 0.3356 1.0462 4.6308 15.7281 0.5617 17.9434 25.4204 61.0317 36.8086 55.2765 15.7717
temp: 298.150 k
press: 1.00000 atm
elementType: 7 6 6 6 6 6 6 6 6 6 6 6 6 6 6 6 6 6 6 6 6 6 1 1 1 1 1 1 1 1 1 1 1 1 1 1 1 1 1
symmnumber: 1
zpe: 817729.5 jmol-1
zpe.correction: 0.311457 hartree
zpe.thermalcorrener: 0.329769 hartree
zpe.thermalcorrenthalpy: 0.330713 hartree
zpe.thermalcorrgfe: 0.261333 hartree
zpe.sumelectzpe: -863.675064 hartree
zpe.sumelectthermal: -863.656751 hartree
zpe.sumelectthermalent: -863.655807 hartree
zpe.sumelectthermalfe: -863.725188 hartree
dipole: 0.0001 0.9518 0.0000
dipole: 0.9518
quadrupole: -103.8486 -102.7885 -140.3425
quadrupole: 0.0000 0.0818 -0.0329
quadrupole: 11.8113 12.8713 -24.6826 0.0000 0.0818 -0.0329
hfenergy: -863.9865204 hartree
pointgroup: C01 [X(C21H17N1)]
dipole: -0.0000025 -0.3744725 -0.0001495 debye
polarizability: 439.7648341|-0.005988|359.6670761|-4.4790593|0.0133448|87.6051253 unknown
InChI: InChI=1S/C21H17N/c1-3-8-18(9-4-1)14-16-20-12-7-13-21(22-20)17-15-19-10-5-2-6-11-19/h1-17H
charge 0 multiplicity 1
39 atoms
N  -0.000875 -1.457872 -0.001552
C  -1.183528 -2.152697 0.01344
C  1.181641 -2.152931 -0.017562
C  -3.730589 0.79908 0.04378
C  3.729361 0.798324 -0.043021
C  -2.445865 -1.396146 0.030279
C  2.444129 -1.396619 -0.033105
C  -1.216165 -3.57971 0.013172
C  1.213959 -3.57995 -0.019484
C  -2.516159 -0.028769 0.027825
C  2.514738 -0.029262 -0.02874
C  -0.00118 -4.293987 -0.003719
C  -5.050882 0.257991 0.069544
C  -3.591054 2.217743 0.033267
C  5.049658 0.256968 -0.062085
C  3.590018 2.217032 -0.037522
C  -6.17783 1.101929 0.083779
C  -4.719205 3.064167 0.047412
C  6.176778 1.100693 -0.075246
C  4.718339 3.063252 -0.050717
C  -6.020003 2.510186 0.072743
C  6.019129 2.509005 -0.06969
H  -3.359522 -2.005104 0.044847
H  3.357674 -2.005722 -0.048681
H  -1.555196 0.503864 0.011805
H  -2.177837 -4.103307 0.025857
H  2.175528 -4.103718 -0.032984
H  1.553901 0.5036 -0.012796
H  -0.0013 -5.389099 -0.004591
H  -5.195711 -0.828009 0.0788
H  -2.583387 2.650952 0.013512
H  5.194387 -0.829077 -0.066442
H  2.582363 2.650464 -0.022679
H  -7.183503 0.66678 0.103682
H  -4.58618 4.151734 0.038779
H  7.182454 0.665341 -0.089794
H  4.585455 4.150861 -0.046161
H  -6.899307 3.163729 0.083925
H  6.898568 3.162384 -0.079977
