program: Gaussian 09
title: 000095441
version: EM64L-G09RevD.01
frameworkgroup: C1[X(C12H15NO4)]
method: RPBEPBE
basis: SDD
operation: Freq
keyword: #p
keyword: freq=noraman
keyword: PBEPBE/SDD
title: #p freq=noraman PBEPBE/SDD
converged: YES YES NO NO
title: Mulliken charges:
elementType: O O O O N C C C C C C C C C C C C H H H H H H H H H H H H H H H
charge: -0.264513 -0.409058 -0.259352 -0.235960 -0.594564 -0.407163 -0.204648 -0.500009 0.275853 0.140864 -0.437887 0.480168 -0.399568 -0.374017 -0.223900 -0.223889 -0.231846 0.240558 0.215956 0.312206 0.251290 0.279233 0.230419 0.234445 0.284089 0.287437 0.233272 0.234935 0.228683 0.228190 0.230775 0.378002
chargesum: 0.00000
title: Mulliken charges with hydrogens summed into heavy atoms:
elementType: O O O O N C C C C C C C C C C C C
charge: -0.264513 -0.031056 -0.259352 -0.235960 -0.023037 0.049350 0.107559 0.030514 0.275853 0.140864 0.026976 0.480168 -0.166296 -0.139082 0.004782 0.004301 -0.001071
polarizability: 2.09586906e+02 6.20175155e+00 1.33594328e+02 1.38550868e+01 -7.38159712e+00 1.04371400e+02
1716.lowfreq: -10.1619 -5.9996 -0.0008 -0.0007 -0.0006 3.9534 7.4125 13.0500 25.5501
frequency: 4.5210 12.4386 25.2547 34.3670 40.1611 57.1367 84.0427 136.1107 170.6170 181.9723 207.2169 213.8749 263.0167 273.2211 306.3827 326.6938 373.9006 402.2845 426.9041 489.8385 511.3508 549.1702 568.9829 577.8682 610.4997 617.4007 670.8413 691.0905 702.1749 704.2158 754.9807 779.2288 806.8023 853.0916 859.5735 883.0840 906.9960 929.0871 950.7578 964.4457 972.5510 976.7763 990.9946 997.6596 1027.0747 1038.7297 1067.1852 1088.2573 1105.5271 1136.9350 1159.7750 1173.3617 1187.6609 1189.6546 1221.3526 1223.5079 1228.3566 1274.1039 1298.2742 1324.6986 1329.4009 1339.2828 1360.2572 1385.9954 1386.3072 1429.4533 1440.8290 1459.6137 1471.4822 1487.9038 1596.6884 1617.4647 1624.8995 1649.6906 1655.6028 2982.1510 2997.8503 3014.3562 3048.1074 3069.1520 3076.2973 3078.0571 3122.2923 3124.3089 3136.6536 3149.2579 3165.4929 3450.7372 3500.7805 3573.5455
redmass: 4.1609 4.6883 6.2848 9.6896 7.0510 5.3369 4.8422 4.6712 4.0827 4.8059 2.8271 1.2141 5.2076 3.3995 3.6007 2.3247 2.9778 2.7925 3.3139 3.3699 2.9578 4.0273 4.5505 1.7853 2.1937 6.2793 4.2312 3.4556 1.7903 1.5612 1.8939 2.6232 4.2869 1.2493 4.0279 4.7409 3.2407 1.5979 1.6773 2.2687 2.3351 1.3936 6.0870 1.3289 2.1693 2.6987 2.2357 1.5165 2.6077 1.4664 2.4222 1.0542 1.1160 1.0931 1.3738 1.3522 2.3039 1.7421 1.4299 1.2867 1.4442 1.3437 1.5803 1.3980 8.0486 1.1085 2.1955 1.0916 1.0986 2.4400 6.1551 6.2893 9.1421 6.5058 1.1389 1.0647 1.0634 1.0578 1.0844 1.0938 1.1002 1.1075 1.0853 1.0883 1.0919 1.0963 1.1017 1.0460 1.0640 1.0960
irintensity: 0.0239 0.0592 0.4485 1.1501 0.7240 1.0326 0.9406 1.6573 0.5708 5.2936 9.7915 33.6552 7.4342 7.9112 5.8481 2.1719 22.8199 0.2757 23.2438 16.3919 3.3596 2.7644 3.7951 87.7991 47.4348 0.5135 7.8535 44.4783 61.2023 239.5111 89.1679 7.2490 0.3890 0.0712 9.5445 85.5480 28.2927 2.3913 1.9303 9.6961 30.3484 0.0229 1.3608 0.1497 5.5732 235.2158 73.4438 7.3795 507.7212 0.7913 61.6410 0.0096 0.4489 2.1319 7.1518 13.7038 6.6063 14.0685 60.0469 3.9620 35.0758 20.3980 12.5754 1.3475 0.4165 35.5196 9.1822 13.8469 7.4499 7.6176 0.7555 9.0113 196.3158 273.3650 12.6015 38.2278 24.1780 17.6924 9.3984 9.4687 9.7414 14.5639 5.4468 2.1865 14.4956 40.0460 20.8474 2.0793 12.6001 7.0136
temp: 298.150 k
press: 1.00000 atm
elementType: 8 8 8 8 7 6 6 6 6 6 6 6 6 6 6 6 6 1 1 1 1 1 1 1 1 1 1 1 1 1 1 1
symmnumber: 1
zpe: 665889.0 jmol-1
zpe.correction: 0.253624 hartree
zpe.thermalcorrener: 0.271054 hartree
zpe.thermalcorrenthalpy: 0.271998 hartree
zpe.thermalcorrgfe: 0.202206 hartree
zpe.sumelectzpe: -820.656631 hartree
zpe.sumelectthermal: -820.639201 hartree
zpe.sumelectthermalent: -820.638257 hartree
zpe.sumelectthermalfe: -820.708048 hartree
dipole: 1.6507 -0.2557 0.3996
dipole: 1.7175
quadrupole: -92.9984 -91.5471 -100.5227
quadrupole: 5.3179 2.6273 -6.0136
quadrupole: 2.0243 3.4756 -5.5000 5.3179 2.6273 -6.0136
hfenergy: -820.9102549 hartree
pointgroup: C01 [X(C12H15N1O4)]
dipole: -0.6534845 0.095011 0.1432643 debye
polarizability: 209.5967392|7.0240619|134.708931|-13.1784694|5.2003544|103.2469637 unknown
InChI: InChI=1S/C12H15NO4/c13-10(12(15)16)6-7-11(14)17-8-9-4-2-1-3-5-9/h1-5,10,15H,6-8,13H2
charge 0 multiplicity 1
32 atoms
O  -0.802693 -0.018594 0.174776
O  5.063687 1.651414 -0.569712
O  0.969244 0.448852 -1.261852
O  6.165488 -0.137813 0.417008
N  3.790795 -1.729181 0.306174
C  2.816638 0.458028 1.036174
C  3.717681 -0.294357 0.003346
C  1.404001 -0.152362 1.107166
C  0.555596 0.134552 -0.117924
C  5.104707 0.365007 -0.018929
C  -1.742567 0.190177 -0.987181
C  -3.151157 0.054748 -0.467525
C  -3.854729 -1.167726 -0.605205
C  -3.79387 1.15074 0.162745
C  -5.175552 -1.296131 -0.119863
C  -5.112585 1.025625 0.651602
C  -5.807121 -0.19905 0.510241
H  2.776513 1.526834 0.761712
H  3.280693 0.381039 2.039048
H  3.248396 -0.150146 -0.985682
H  0.856729 0.188043 2.003089
H  1.519166 -1.252904 1.188468
H  -1.500593 -0.56488 -1.75584
H  -1.534553 1.190637 -1.40653
H  4.467868 -1.945392 1.047717
H  3.947686 -2.318253 -0.517075
H  -3.365362 -2.020589 -1.091166
H  -3.256705 2.100612 0.272299
H  -5.710184 -2.245683 -0.233336
H  -5.599425 1.878786 1.136941
H  -6.832128 -0.296087 0.885407
H  5.975339 2.052352 -0.547691
