program: Gaussian 09
title: 000009388
version: EM64L-G09RevD.01
frameworkgroup: C1[X(C8F18O2S)]
method: RPBEPBE
basis: SDD
operation: Freq
keyword: #p
keyword: freq=noraman
keyword: PBEPBE/SDD
title: #p freq=noraman PBEPBE/SDD
converged: YES YES NO NO
title: Mulliken charges:
elementType: S F F F F F F F F F F F F F F F F F F O O C C C C C C C C
charge: 1.135749 -0.110565 -0.118189 -0.125488 -0.105531 -0.118147 -0.116345 -0.114928 -0.117550 -0.113920 -0.122903 -0.075840 -0.069254 -0.122008 -0.119848 -0.310886 -0.121437 -0.117757 -0.127202 -0.421971 -0.427359 0.252173 0.224057 0.254260 0.303095 0.260033 0.063395 0.209484 0.374881
chargesum: 0.00000
title: Mulliken charges with hydrogens summed into heavy atoms:
polarizability: 1.61481349e+02 4.83386022e+00 1.22818760e+02 -4.77212680e+00 -4.52703251e+00 1.19194776e+02
1716.lowfreq: 0.0009 0.0015 0.0015 1.3492 3.0173 5.4694 15.0380 25.1989 28.0127
frequency: 15.0325 25.1614 28.0045 30.4970 45.8641 55.0292 60.9682 76.1124 92.9949 110.1425 122.2285 127.8538 132.1747 143.5317 150.6900 163.1412 172.3731 190.7973 202.3039 207.1218 215.2658 219.0568 226.4882 237.7020 248.5694 256.5430 269.0236 273.1002 282.1800 286.7860 297.8584 301.4556 302.6344 315.2324 317.2234 327.6487 331.8082 337.7391 379.1867 404.2573 410.3045 423.3139 441.8378 462.8489 494.2639 508.3658 514.6934 542.0607 558.3618 560.7266 570.9618 584.1233 588.7153 628.4725 648.5258 656.0366 816.3884 862.2995 880.6440 913.1255 958.8058 985.7396 1004.8611 1009.9747 1017.0115 1026.8485 1032.4503 1038.5264 1041.2268 1050.9350 1056.7314 1077.7496 1086.0103 1106.0388 1116.6721 1122.0204 1129.4119 1136.6720 1151.3284 1191.1750 1193.6625
redmass: 17.6651 18.0439 17.9999 18.2761 18.5069 18.0554 18.2638 18.3987 17.4672 18.4697 18.2356 18.0373 18.0197 18.4069 17.6928 17.7670 18.0459 17.8429 18.1438 18.1474 18.1668 18.5615 18.3653 18.2810 18.6574 18.4620 18.7138 18.3401 18.6087 18.6844 18.6209 18.6624 18.5704 18.6249 18.4974 18.3435 18.6517 18.6347 17.7226 20.8118 18.0213 17.8384 17.4597 17.8276 17.2326 17.2433 17.6059 16.9097 17.2597 19.8033 17.9372 17.5361 17.6062 16.7389 15.2774 16.7020 13.3450 14.2858 16.7147 13.5937 13.6623 13.5886 16.2433 15.5768 13.3509 13.4293 13.2784 13.3420 12.9243 13.1058 13.1874 13.2733 13.1723 12.9848 12.9371 12.6211 12.5915 12.3098 12.1156 12.3460 12.3110
irintensity: 0.2551 0.0848 0.0265 0.2340 0.0691 0.3169 0.1716 0.2655 0.6654 0.4839 0.9893 0.3428 0.5675 1.0898 2.8382 0.4687 1.3358 20.2608 2.5829 8.6403 3.0235 0.6929 1.2659 0.6832 0.9785 1.3265 12.3915 1.0334 4.3385 1.6195 0.9060 0.8361 1.7700 1.4567 0.0294 2.6447 0.9770 1.0311 3.2907 95.3817 4.2029 5.0977 1.5456 8.5330 11.0087 0.9289 1.8304 67.8956 7.9014 52.2404 11.4490 7.8229 0.3211 44.9045 117.3676 1.6723 193.2518 96.7615 14.8048 46.9213 74.3578 6.6110 22.7540 174.3830 12.3916 74.5330 27.7325 39.0266 63.8396 110.3938 142.6920 302.9707 287.1138 94.9771 91.7762 56.8893 59.2936 28.1009 9.9134 22.8886 71.9852
temp: 298.150 k
press: 1.00000 atm
elementType: 16 9 9 9 9 9 9 9 9 9 9 9 9 9 9 9 9 9 9 8 8 6 6 6 6 6 6 6 6
symmnumber: 1
zpe: 254695.1 jmol-1
zpe.correction: 0.097008 hartree
zpe.thermalcorrener: 0.127171 hartree
zpe.thermalcorrenthalpy: 0.128115 hartree
zpe.thermalcorrgfe: 0.034025 hartree
zpe.sumelectzpe: -2647.991139 hartree
zpe.sumelectthermal: -2647.960977 hartree
zpe.sumelectthermalent: -2647.960033 hartree
zpe.sumelectthermalfe: -2648.054122 hartree
dipole: 1.7523 1.7026 -0.3012
dipole: 2.4617
quadrupole: -183.6910 -174.4329 -173.7936
quadrupole: -5.8110 0.3379 -0.0085
quadrupole: -6.3852 2.8730 3.5122 -5.8110 0.3379 -0.0085
hfenergy: -2648.0881477 hartree
pointgroup: C01 [X(C8F18O2S1)]
dipole: -0.6825391 -0.6278137 -0.2793315 debye
polarizability: 161.4984837|4.1955349|120.4335559|5.2524735|4.8696194|121.5628464 unknown
InChI: InChI=1S/C8F18O2S/c9-1(10,3(13,14)5(17,18)7(21,22)23)2(11,12)4(15,16)6(19,20)8(24,25)29(26,27)28
charge 0 multiplicity 1
29 atoms
S  4.867286 0.807752 0.352248
F  -0.06766 -2.49632 0.750362
F  -1.39524 -1.76934 -0.952377
F  1.254508 -1.913078 -1.526679
F  0.388692 0.194376 -1.646612
F  -2.220405 -1.248861 1.672259
F  -0.303196 -0.066954 2.062996
F  2.238937 -1.09129 1.210891
F  1.780353 1.036197 0.479939
F  -2.470843 1.469228 1.819458
F  -0.968991 1.784315 0.129188
F  3.939678 -1.53826 -0.859932
F  3.269791 0.333832 -1.9578
F  -2.613342 0.559308 -1.69446
F  -3.568906 2.257145 -0.505334
F  4.506168 2.38324 -0.526135
F  -4.89996 0.233565 1.132121
F  -5.408721 0.393944 -1.073163
F  -4.133887 -1.325066 -0.33557
O  4.523544 1.02889 1.897083
O  6.287086 0.273947 -0.150991
C  -0.471512 -1.349003 0.032807
C  0.796089 -0.815269 -0.752046
C  -1.23925 -0.430822 1.064905
C  2.038567 -0.288558 0.069679
C  -1.960394 0.906787 0.627442
C  3.378977 -0.279356 -0.726416
C  -3.134609 0.914554 -0.431254
C  -4.412559 0.034995 -0.162809
