program: Gaussian 09
title: 000095446
version: EM64L-G09RevD.01
frameworkgroup: C1[X(C16H17NO2)]
method: RPBEPBE
basis: SDD
operation: Freq
keyword: #p
keyword: freq=noraman
keyword: PBEPBE/SDD
title: #p freq=noraman PBEPBE/SDD
converged: YES YES NO NO
title: Mulliken charges:
elementType: O O N C C C C C C C C C C C C C C C C H H H H H H H H H H H H H H H H H
charge: -0.451588 -0.273581 -0.146925 -0.362097 0.354333 0.039756 0.580340 0.407825 -0.370475 -0.387456 -0.366012 -0.354655 -0.446801 -0.381309 -0.646417 -0.644208 -0.233882 -0.224390 -0.245408 0.226996 0.238834 0.273769 0.240075 0.241893 0.229094 0.252951 0.241702 0.221686 0.240333 0.220748 0.241759 0.241647 0.224652 0.224116 0.365993 0.226701
chargesum: 0.00000
title: Mulliken charges with hydrogens summed into heavy atoms:
elementType: O O N C C C C C C C C C C C C C C C C
charge: -0.085595 -0.273581 -0.146925 -0.135101 0.354333 0.039756 0.580340 0.407825 -0.131641 -0.113687 -0.125937 -0.112762 -0.217707 -0.128358 0.057305 0.059945 -0.009230 -0.000274 -0.018707
polarizability: 2.64383280e+02 -1.76459721e+01 1.92672413e+02 2.25286058e-01 1.70455164e+01 1.42081399e+02
1716.lowfreq: -5.5923 -0.0007 -0.0003 0.0004 3.0700 9.6411 25.4867 30.2251 42.3657
frequency: 25.3093 30.2177 42.3552 70.8769 74.0565 94.7488 112.8999 122.8172 168.0314 190.2003 197.6577 204.6186 261.4875 269.2709 314.2671 330.5081 367.5708 402.5774 419.8086 421.7127 460.8414 482.6409 495.9380 523.8853 541.1803 584.1034 595.1620 615.1552 630.0389 673.2197 704.1023 738.0730 747.2093 770.2664 800.4964 819.8897 830.2955 849.5598 852.2050 922.8265 937.4394 948.3445 955.5505 975.5536 989.1097 990.4507 993.5095 996.0812 1024.3894 1029.3075 1056.1530 1081.3069 1104.7112 1112.5992 1135.7320 1167.2376 1171.4699 1187.0945 1189.0828 1202.6619 1205.8839 1255.3403 1279.3529 1290.5176 1318.0336 1336.7399 1362.7755 1375.6586 1386.7324 1388.3674 1431.3175 1442.1785 1454.7438 1459.7952 1465.5101 1478.2556 1480.6713 1491.2807 1504.5695 1524.7927 1538.3702 1565.0780 1595.1022 1610.3982 1631.9980 2951.6023 2958.3395 2989.6962 3021.7535 3024.7263 3103.1235 3107.8166 3113.1224 3122.3452 3133.2401 3144.5574 3146.9605 3148.9412 3161.5154 3169.2570 3174.1210 3336.4776
redmass: 4.3931 3.8340 3.6882 3.2097 3.0370 6.4346 5.1155 1.4172 3.9996 1.1963 2.8280 4.1524 5.1046 3.8627 3.8513 5.2730 6.3894 2.7981 3.3805 3.3036 3.8746 2.9817 3.8052 2.2937 1.3265 4.6226 4.4667 6.3632 7.0624 4.6141 1.6563 4.6257 4.1554 2.1756 1.4469 2.0226 4.0431 2.8571 1.2524 1.4890 3.4688 1.4139 5.2529 1.3940 1.4099 5.1616 1.8006 1.9679 2.5131 3.0693 1.5181 1.6027 1.2366 1.3305 1.4412 1.6827 1.0606 1.2064 2.0462 1.2887 1.2214 2.8529 1.5298 2.6650 1.3992 1.2893 1.8928 3.1595 6.7217 2.2264 1.2051 2.1636 2.3277 1.4186 1.0400 1.0453 2.2573 1.1249 1.1528 3.7342 3.8296 6.4656 6.0732 6.0409 6.1930 1.0366 1.0390 1.0841 1.0998 1.1029 1.0968 1.0878 1.0949 1.0857 1.0911 1.0960 1.0878 1.0873 1.1014 1.0948 1.0956 1.0635
irintensity: 0.2886 0.1594 0.1494 0.2440 0.0869 0.9158 0.3256 3.5560 4.5436 0.2343 0.2826 5.0624 1.5373 6.6796 7.8616 8.7012 29.7065 0.4746 3.8904 4.4277 4.5802 21.3645 3.3601 11.9312 106.7132 54.3881 6.4702 0.9912 0.2111 14.9638 68.0100 4.2766 15.7853 17.9016 19.5914 34.4936 15.5015 34.2520 0.5607 7.4667 87.0253 1.1392 85.7429 0.1569 1.3550 2.7611 13.8772 5.7168 16.7671 36.7979 24.1167 10.7605 0.0012 0.9369 4.9204 6.1028 0.8461 2.0246 93.5469 45.0440 98.1257 21.4606 8.4274 288.8996 38.1781 2.8058 380.5828 13.2813 0.6416 21.0423 5.6109 9.2304 16.9709 6.9200 0.0797 24.2600 11.4990 4.8978 36.1518 373.7429 3.7710 76.6686 1.2649 13.4893 395.7622 81.2532 102.3727 33.5798 4.4689 67.1590 3.6326 10.7043 40.1860 0.3945 13.9012 33.4095 0.3134 6.0609 26.6533 19.9323 9.0406 88.8497
temp: 298.150 k
press: 1.00000 atm
elementType: 8 8 7 6 6 6 6 6 6 6 6 6 6 6 6 6 6 6 6 1 1 1 1 1 1 1 1 1 1 1 1 1 1 1 1 1
symmnumber: 1
zpe: 763737.4 jmol-1
zpe.correction: 0.290892 hartree
zpe.thermalcorrener: 0.308771 hartree
zpe.thermalcorrenthalpy: 0.309715 hartree
zpe.thermalcorrgfe: 0.243328 hartree
zpe.sumelectzpe: -823.719054 hartree
zpe.sumelectthermal: -823.701176 hartree
zpe.sumelectthermalent: -823.700232 hartree
zpe.sumelectthermalfe: -823.766618 hartree
dipole: 7.7500 -4.7908 0.5669
dipole: 9.1288
quadrupole: -94.1527 -112.9529 -108.5135
quadrupole: 4.3738 -3.9094 6.1942
quadrupole: 11.0537 -7.7465 -3.3071 4.3738 -3.9094 6.1942
hfenergy: -824.0099466 hartree
pointgroup: C01 [X(C16H17N1O2)]
dipole: 3.0393026 -1.8760899 -0.3770585 debye
polarizability: 264.2288376|-17.6688109|176.9370505|-4.315506|28.9148941|157.9712039 unknown
InChI: InChI=1S/C16H17NO2/c1-17(2)14-10-8-13(9-11-14)16(19)15(18)12-6-4-3-5-7-12/h3-11,15,18H,1-2H3
charge 0 multiplicity 1
36 atoms
O  -3.035458 2.360803 -0.349472
O  -1.043547 2.515561 1.323841
N  4.375148 -0.733827 -0.142378
C  -1.999727 1.35604 -0.563582
C  0.499862 1.022685 0.228773
C  -0.810329 1.668675 0.393431
C  -2.554576 -0.053215 -0.33147
C  3.113476 -0.161825 -0.021182
C  0.792747 0.100139 -0.81691
C  1.545996 1.338848 1.145159
C  2.061005 -0.479417 -0.944712
C  2.816773 0.769062 1.033186
C  -2.730073 -0.946792 -1.414471
C  -2.947732 -0.458746 0.969119
C  4.654738 -1.687167 -1.227343
C  5.439338 -0.393034 0.815029
C  -3.283301 -2.23096 -1.205915
C  -3.496345 -1.741227 1.180837
C  -3.664647 -2.63313 0.094228
H  -1.659948 1.447474 -1.61431
H  0.017135 -0.181014 -1.53601
H  1.325545 2.05025 1.948182
H  2.238801 -1.183439 -1.761804
H  3.586041 1.042575 1.760298
H  -2.455036 -0.629369 -2.429061
H  -2.828038 0.232963 1.81108
H  3.998742 -2.578235 -1.16754
H  5.698524 -2.029102 -1.154356
H  4.516235 -1.223901 -2.224455
H  6.357058 -0.940615 0.551064
H  5.161908 -0.670722 1.851212
H  5.671685 0.690188 0.79918
H  -3.423462 -2.910872 -2.054015
H  -3.796026 -2.046757 2.189872
H  -2.769197 2.837536 0.494199
H  -4.094415 -3.627634 0.259396
