program: Gaussian 09
title: 000095401
version: EM64L-G09RevD.01
frameworkgroup: C1[X(C11H22O2)]
method: RPBEPBE
basis: SDD
operation: Freq
keyword: #pfreq=noraman
keyword: PBEPBE/SDD
title: #p freq=noraman PBEPBE/SDD
converged: YES YES NO NO
title: Mulliken charges:
elementType: O O C C C C C C C C C C C H H H H H H H H H H H H H H H H H H H H H H
charge: -0.257007 -0.239728 0.013458 -0.442852 0.029160 -0.377225 -0.388011 -0.365529 -0.328926 -0.354600 -0.715673 -0.356154 -0.696619 0.176806 0.225646 0.211880 0.181518 0.228090 0.178660 0.196040 0.226230 0.193256 0.186296 0.231133 0.180983 0.186296 0.190379 0.233199 0.201497 0.227959 0.194366 0.195670 0.214639 0.209067 0.210093
chargesum: 0.00000
title: Mulliken charges with hydrogens summed into heavy atoms:
elementType: O O C C C C C C C C C C C
charge: -0.257007 -0.239728 0.190264 -0.005326 0.210679 0.029525 0.034260 0.014023 0.083190 0.022075 -0.053017 0.033882 -0.062819
polarizability: 1.60961488e+02 6.98282083e-01 1.15426987e+02 3.25750482e-02 8.09726681e-01 1.02243513e+02
1716.lowfreq: -0.0006 0.0003 0.0007 8.3906 9.7732 18.6544 34.4812 43.4205 50.9774
frequency: 34.0195 43.2034 50.9158 80.9805 114.2854 126.2253 138.6154 156.3684 183.4439 198.2310 210.6258 230.8871 262.4242 287.4076 334.1475 411.0519 414.6947 425.3666 482.7751 493.7091 543.9606 632.7300 722.3584 730.7894 761.1079 795.8789 818.5877 853.3526 875.6078 890.3020 898.1384 931.1852 962.0555 975.8027 990.5093 1010.8417 1032.6119 1037.3725 1067.7101 1079.3987 1082.3535 1093.4564 1120.0551 1132.1712 1153.7515 1174.1023 1198.6988 1207.0579 1226.3512 1229.9273 1248.8818 1276.3855 1279.8651 1287.4489 1294.3054 1298.4724 1301.0837 1322.9909 1341.6559 1350.9164 1356.0086 1359.2543 1363.5448 1384.4524 1388.3723 1392.6297 1434.7249 1451.7991 1458.3406 1463.4948 1463.9597 1465.4033 1474.4485 1477.1323 1478.6211 1483.1155 1488.8229 2867.8796 2908.7563 2931.6159 2951.0819 2954.9309 2963.7542 2968.3795 2971.3225 2988.1435 2989.7754 2993.5345 3000.5092 3005.4516 3026.5411 3040.0465 3063.6285 3067.6582 3069.7611 3070.1041 3084.8630 3089.4304 3098.2194
redmass: 3.1159 1.7689 3.4379 2.8641 1.6917 3.0926 2.3276 3.1641 1.3960 3.2995 1.9456 1.1300 2.8910 2.0493 2.7969 3.5148 3.8404 3.0647 3.1841 2.5165 3.1415 3.0580 1.0806 1.2437 1.4970 2.6318 1.5678 2.4145 2.4427 1.8657 1.4783 3.5637 1.5325 1.5244 1.3077 3.7942 3.7549 3.1095 2.6993 2.3014 2.0925 2.1181 2.3688 2.0057 1.9704 2.1478 1.5981 1.3575 1.2627 1.2993 1.3216 1.2761 1.0993 1.1142 1.1065 1.1672 1.2578 1.3512 1.2450 1.4517 1.5486 1.6048 1.3252 1.4149 1.2180 1.5254 1.0968 1.0835 1.0473 1.0677 1.0921 1.0756 1.0708 1.0423 1.0500 1.0807 1.0925 1.0825 1.0831 1.0696 1.0588 1.0593 1.0636 1.0598 1.0368 1.0961 1.0413 1.0550 1.0619 1.0973 1.1007 1.1014 1.1007 1.1010 1.1026 1.0993 1.0957 1.0993 1.1001
irintensity: 0.2482 0.2266 0.6350 0.8266 0.2750 1.0225 0.3619 1.2115 1.4814 0.3600 2.3851 0.0167 1.3794 3.5884 1.1798 2.8500 3.4671 0.1513 4.3150 5.6384 2.0839 2.2085 9.5745 6.5819 8.9473 6.1959 23.9650 8.0575 17.0203 2.6471 23.4665 75.1253 12.1644 18.9128 8.4253 5.9787 26.5604 1.5998 7.3837 48.4642 2.0186 97.1448 9.1783 16.2462 29.2311 2.5940 2.7557 7.2324 11.1667 5.7224 4.1991 1.2944 0.7205 1.4763 7.4240 20.8656 1.4836 2.4401 25.1907 1.3017 11.5074 7.8503 0.2958 33.2927 8.4824 11.2893 8.9179 5.2761 10.9352 1.3014 9.1112 0.2413 1.5898 12.2097 7.7550 1.3903 24.8465 64.1047 47.5301 90.0454 1.0942 9.2920 9.5162 128.2364 36.1155 2.7753 10.7530 48.7509 22.5052 6.5493 20.7475 46.5263 26.1912 40.2567 114.0393 55.7354 33.6424 36.7796 31.9023
temp: 298.150 k
press: 1.00000 atm
elementType: 8 8 6 6 6 6 6 6 6 6 6 6 6 1 1 1 1 1 1 1 1 1 1 1 1 1 1 1 1 1 1 1 1 1 1
symmnumber: 1
zpe: 821829.3 jmol-1
zpe.correction: 0.313018 hartree
zpe.thermalcorrener: 0.328468 hartree
zpe.thermalcorrenthalpy: 0.329412 hartree
zpe.thermalcorrgfe: 0.269398 hartree
zpe.sumelectzpe: -581.720113 hartree
zpe.sumelectthermal: -581.704664 hartree
zpe.sumelectthermalent: -581.703719 hartree
zpe.sumelectthermalfe: -581.763733 hartree
dipole: -1.6693 0.8191 1.4530
dipole: 2.3599
quadrupole: -72.1388 -83.2129 -81.4297
quadrupole: -5.2417 -2.9769 -0.0327
quadrupole: 6.7884 -4.2858 -2.5026 -5.2417 -2.9769 -0.0327
hfenergy: -582.0331312 hartree
pointgroup: C01 [X(C11H22O2)]
dipole: -0.6586328 0.3291252 0.565578 debye
polarizability: 160.9592683|0.7501228|115.4479798|0.1772023|0.6351384|102.2247399 unknown
InChI: InChI=1S/C11H22O2/c1-3-4-5-6-7-11-12-9-8-10(2)13-11/h10-11H,3-9H2,1-2H3
charge 0 multiplicity 1
35 atoms
O  -2.332865 -0.975497 -0.046499
O  -1.3532 1.214643 -0.382034
C  -1.227753 -0.078362 0.298985
C  0.072702 -0.732075 -0.150069
C  -3.644515 -0.396661 0.356499
C  1.325612 0.059802 0.283246
C  -3.820383 0.980857 -0.32087
C  2.63792 -0.586934 -0.211863
C  -2.612585 1.880143 0.007952
C  3.899147 0.195747 0.217396
C  -4.707355 -1.422683 -0.031921
C  5.215202 -0.435551 -0.291183
C  6.469337 0.353852 0.142598
H  -1.257317 0.109286 1.402994
H  0.037788 -0.825165 -1.251705
H  0.097259 -1.756776 0.266774
H  -3.628449 -0.254134 1.463462
H  1.247579 1.093677 -0.103546
H  1.352076 0.136993 1.39095
H  -4.757058 1.459306 0.027339
H  -3.887444 0.837043 -1.414889
H  2.61283 -0.661653 -1.319145
H  2.705506 -1.628218 0.168187
H  -2.630657 2.827008 -0.554799
H  -2.586971 2.106798 1.098369
H  3.931157 0.26345 1.32526
H  3.826742 1.239151 -0.154801
H  -4.515453 -2.386004 0.470903
H  -5.71411 -1.06781 0.254548
H  -4.690073 -1.593918 -1.122627
H  5.286369 -1.478557 0.079791
H  5.182627 -0.501589 -1.397944
H  7.396379 -0.115983 -0.234667
H  6.541767 0.407121 1.2455
H  6.435586 1.391395 -0.240492
