program: Gaussian 09
title: 000095411
version: EM64L-G09RevD.01
frameworkgroup: C1[X(C8H8O7)]
method: RPBEPBE
basis: SDD
operation: Freq
keyword: #p
keyword: freq=noraman
keyword: PBEPBE/SDD
title: #p freq=noraman PBEPBE/SDD
converged: YES YES NO NO
title: Mulliken charges:
elementType: O O O O O O O C C C C C C C C H H H H H H H H
charge: -0.203586 -0.264264 -0.264289 -0.123733 -0.123696 -0.224583 -0.224437 -0.155580 -0.151758 0.203197 0.202819 0.324897 0.324846 -0.753708 -0.753718 0.318416 0.318494 0.257513 0.265362 0.252509 0.257591 0.265121 0.252586
chargesum: 0.00000
title: Mulliken charges with hydrogens summed into heavy atoms:
elementType: O O O O O O O C C C C C C C C
charge: -0.203586 -0.264264 -0.264289 -0.123733 -0.123696 -0.224583 -0.224437 0.162837 0.166736 0.203197 0.202819 0.324897 0.324846 0.021677 0.021581
polarizability: 1.31390750e+02 4.65218722e-02 1.09634946e+02 3.04517809e-01 1.70406243e-01 8.31407592e+01
1716.lowfreq: -8.1575 -7.3166 0.0005 0.0010 0.0012 2.3408 15.5050 26.6223 30.6094
frequency: 15.1139 26.2039 30.4925 41.8615 63.3694 75.9062 84.2501 119.1707 134.7363 190.5536 238.3189 253.4631 271.4720 320.7765 349.3746 396.6978 448.5821 516.9940 550.5422 556.5230 569.6261 576.9997 579.7193 638.6246 660.6442 706.7748 794.0588 808.7354 833.2146 895.6474 961.1002 975.4516 992.4031 1010.4551 1040.5782 1044.8229 1045.3255 1092.5369 1116.7524 1170.7507 1180.0832 1222.4880 1246.5655 1290.5889 1308.7743 1388.3687 1389.1734 1450.8619 1451.5558 1452.7184 1453.2104 1679.8830 1680.7345 1720.5867 1790.1452 2985.8542 2990.6524 3010.6592 3011.4142 3100.4672 3100.9405 3148.2412 3149.0436
redmass: 4.9927 1.4813 4.8581 4.7930 1.4237 3.1162 2.2136 6.2390 15.8911 6.4510 9.1457 5.5850 10.0635 9.1307 3.7326 7.3387 4.7631 5.0942 3.1769 3.1969 11.0923 6.7775 4.7878 6.3549 4.9201 8.6300 7.4415 7.7410 10.8904 6.5098 5.3700 2.5688 2.3342 4.4897 4.1921 1.7027 1.6502 10.5271 2.4576 2.9018 3.0579 1.3412 1.2355 1.4190 1.6747 1.2352 1.2403 1.0507 1.0512 1.0536 1.0525 9.9455 10.0541 13.0957 13.0429 1.0823 1.0803 1.0379 1.0375 1.0963 1.0955 1.1018 1.1015
irintensity: 0.4637 2.1746 0.9697 2.5040 1.9574 3.2629 0.6840 3.0747 1.1526 7.7326 4.2807 6.1004 0.0654 8.9724 17.1411 18.4519 0.0091 66.5871 2.0210 3.1036 6.6857 6.6402 12.8412 1.7666 12.4277 6.4249 8.8860 36.5549 320.5747 51.2688 222.4503 2.5956 187.5867 163.3492 5.2524 16.7309 5.1319 153.7697 8.8960 290.9548 222.0669 9.3350 25.1375 24.9584 13.9829 84.6415 38.2576 26.6090 22.1677 20.1769 26.0353 55.8186 284.9592 476.7157 85.1473 53.3973 31.2010 0.0837 0.1040 3.0477 3.5568 6.1271 6.3517
temp: 298.150 k
press: 1.00000 atm
elementType: 8 8 8 8 8 8 8 6 6 6 6 6 6 6 6 1 1 1 1 1 1 1 1
symmnumber: 1
zpe: 409132.6 jmol-1
zpe.correction: 0.155830 hartree
zpe.thermalcorrener: 0.171466 hartree
zpe.thermalcorrenthalpy: 0.172410 hartree
zpe.thermalcorrgfe: 0.108540 hartree
zpe.sumelectzpe: -835.097137 hartree
zpe.sumelectthermal: -835.081502 hartree
zpe.sumelectthermalent: -835.080558 hartree
zpe.sumelectthermalfe: -835.144428 hartree
dipole: 0.0530 -4.7485 -0.0067
dipole: 4.7488
quadrupole: -83.8379 -93.7133 -88.9261
quadrupole: -0.0022 11.8896 -0.0606
quadrupole: 4.9879 -4.8875 -0.1004 -0.0022 11.8896 -0.0606
hfenergy: -835.2529678 hartree
pointgroup: C01 [X(C8H8O7)]
dipole: 0.0855801 1.8662259 -0.0232768 debye
dipolederiv: -1.9560814 0.0679074 -0.1416231 0.066304 -0.679713 0.0120416 -0.2040552 0.0155141 -0.2201841 -0.8750571 0.5772436 -0.1391841 0.7088115 -0.9947209 0.2095789 -0.1350447 0.1550238 -0.4802734 -1.034966 -0.5798679 -0.1534342 -0.7070061 -0.8442672 -0.1790299 -0.1429461 -0.1281484 -0.4745687 -1.0974435 -0.2096069 -0.0471643 -0.2057863 -0.5669431 0.0069147 -0.0065978 0.0374638 -0.2758651 -1.046166 0.2599625 -0.0512805 0.2572925 -0.6180356 0.0047021 -0.0134089 -0.0308371 -0.2744466 -0.4647139 0.183459 0.082895 0.2472215 -0.5275464 0.0067414 -0.1832705 0.2793841 -0.892926 -0.5171221 -0.1896731 0.0750884 -0.249898 -0.4751966 -0.0136119 -0.2224377 -0.2546041 -0.8903425 0.3442893 -0.3768777 0.0167284 -0.228318 0.0437726 0.0514194 -0.2161449 0.3763921 0.1814738 0.4042403 0.3361718 0.0034867 0.1841133 -0.0248699 -0.0486311 -0.2624075 -0.342178 0.1891866 1.9361433 0.1332699 0.1091194 -0.4226763 1.1302733 -0.1245806 0.1277658 -0.1615867 0.2759447 1.9558706 -0.2193534 0.1229268 0.3364339 1.1101959 0.0956206 0.1352648 0.1310313 0.2698803 0.9406755 -0.7332619 -0.0401857 -0.8945922 1.1174721 -0.1589675 0.3183149 -0.4789093 1.2231075 1.1349507 0.7390478 -0.0178353 0.8995931 0.9304586 0.1464714 0.3728052 0.4251458 1.2193625 -0.1889966 0.1623047 0.1576155 0.1205548 -0.0821339 -0.0645374 0.1789355 -0.1389626 -0.1918589 -0.1985557 -0.1367344 0.1562362 -0.1068294 -0.0562165 0.0527792 0.1996292 0.1261062 -0.2069471 0.1289165 -0.025082 -0.0010715 -0.0392674 0.1470606 0.0169323 0.0968914 -0.1188389 0.0604208 0.1380025 0.0266638 -0.0037532 0.0407452 0.1377859 -0.017951 0.1094166 0.1039223 0.0582243 0.0585729 -0.0302542 -0.1015459 0.0173863 0.1039766 -0.0422242 -0.0779479 -0.0357595 0.030739 0.0478908 -0.0514496 0.045663 -0.0792657 0.0301148 0.0123369 0.0283879 0.0139925 0.126102 0.0984803 0.0584593 -0.0113564 0.0841722 -0.0100488 0.039155 -0.0216437 0.0774005 0.0539064 0.0516308 0.0416245 -0.0921604 -0.005075 0.0982888 0.0588716 -0.0726911 0.0471046 0.0439976 0.0700813 0.0418857 0.0492408 0.072741 0.0123501 -0.0284241 0.029325 -0.0274619 0.121448 0.0693574 -0.0758389 -0.0184054 -0.0966549 0.0179426 -0.0356074 -0.0381404 -0.0711948 0.0536187 unknown
polarizability: 131.327201|-1.1914533|109.6933095|-0.1117065|-0.4561647|83.1459441 unknown
InChI: InChI=1S/C8H8O7/c1-3(9)13-5-6(14-4(2)10)8(12)15-7(5)11/h5-6H,1-2H3
charge 0 multiplicity 1
23 atoms
O  -0.24135 -2.754325 -0.047781
O  -1.656471 0.485799 0.472313
O  1.512008 0.30539 -0.6307
O  -2.531484 -2.27006 -0.184562
O  2.087921 -2.516928 0.080248
O  -2.318211 1.575892 -1.489914
O  2.333488 1.311309 1.316087
C  -0.838794 -0.427488 -0.32564
C  0.603207 -0.499871 0.1843
C  -1.37441 -1.863115 -0.182274
C  0.981449 -1.987797 0.070014
C  -2.399025 1.465057 -0.252916
C  2.379706 1.189239 0.078446
C  -3.245014 2.266892 0.699505
C  3.296449 1.884286 -0.892171
H  -0.873732 -0.120752 -1.391843
H  0.673124 -0.179075 1.244611
H  -2.661844 2.558383 1.588002
H  -4.089968 1.646115 1.048175
H  -3.638746 3.156547 0.18805
H  2.72314 2.297169 -1.738464
H  4.01449 1.15417 -1.30632
H  3.846966 2.683363 -0.376167
