program: Gaussian 09
title: 000095398
version: EM64L-G09RevD.01
frameworkgroup: C1[X(C9H16O3)]
method: RPBEPBE
basis: SDD
operation: Freq
keyword: #pfreq=noraman
keyword: PBEPBE/SDD
title: #p freq=noraman PBEPBE/SDD
converged: YES YES NO NO
title: Mulliken charges:
elementType: O O O C C C C C C C C C H H H H H H H H H H H H H H H H
charge: -0.261890 -0.195524 -0.233899 -0.246203 -0.385768 -0.361184 0.204658 0.209912 -0.698831 -0.780329 -0.223301 -0.671289 0.244804 0.205747 0.232902 0.242403 0.185342 0.205104 0.220306 0.217746 0.272902 0.251467 0.229405 0.229306 0.231031 0.214083 0.231115 0.229985
chargesum: 0.00000
title: Mulliken charges with hydrogens summed into heavy atoms:
elementType: O O O C C C C C C C C C
charge: -0.261890 -0.195524 -0.233899 -0.001400 0.052881 0.066561 0.204658 0.209912 -0.055674 -0.026555 0.237036 0.003894
polarizability: 1.27389775e+02 -3.31789527e-01 1.07203996e+02 -3.06882790e+00 2.04993147e+00 8.61446325e+01
1716.lowfreq: -16.2479 -3.2268 -0.0009 -0.0006 -0.0005 7.3595 16.7732 44.1617 57.0342
frequency: 16.5200 44.0989 57.0224 66.7687 83.5663 89.5232 116.3084 127.0189 166.7457 188.3343 231.6591 247.3439 260.0739 282.9846 305.2078 332.4253 391.5474 440.3525 479.6274 601.7414 688.2911 720.4495 725.8664 770.0852 798.6371 815.3996 874.2508 896.8547 941.7330 957.1433 996.8785 1022.6846 1043.6961 1062.9290 1099.3303 1106.5092 1114.2439 1124.5752 1135.0067 1179.9750 1228.9308 1248.1520 1250.7851 1289.5699 1299.9681 1311.1724 1349.8689 1355.0910 1368.9595 1390.3997 1401.1938 1448.0852 1453.1306 1453.6741 1463.6062 1473.3544 1474.2003 1477.6074 1485.7877 1486.2169 1626.0941 1640.3298 2972.8033 2974.8564 2984.5833 2989.4742 2994.5620 2996.6669 3011.2297 3039.6157 3060.1709 3070.1234 3072.7723 3074.6361 3078.5306 3093.0832 3108.4180 3120.9875
redmass: 3.9252 3.5581 2.9984 2.5695 2.0975 2.2672 1.3511 2.6545 2.6307 2.8098 1.1670 1.4527 2.8764 4.0767 3.1287 4.3169 3.9990 3.2948 3.3737 3.2885 5.6367 1.4834 5.6967 1.7729 1.1013 3.0276 1.5086 1.9178 3.0376 2.0551 1.6326 2.3659 2.7557 2.2773 2.1916 2.9809 2.2258 1.8131 1.4662 2.3181 1.5743 1.1508 1.5213 1.2632 1.3381 1.3479 1.4578 1.3947 1.2315 1.2125 1.2607 1.0707 1.0591 1.0755 1.0401 1.0604 1.0571 1.0464 1.0721 1.0691 9.5385 9.0664 1.0435 1.0569 1.0433 1.0704 1.0647 1.0359 1.0582 1.0935 1.1017 1.1067 1.0963 1.0990 1.1021 1.0985 1.1027 1.1004
irintensity: 0.2770 2.7753 1.3826 0.6729 1.8745 0.0720 0.3926 0.0857 3.8743 8.6362 0.1248 1.3457 0.2958 3.1493 1.0792 12.8401 1.9426 6.1630 5.8516 4.9233 3.8552 15.6234 4.5616 3.0795 3.9294 1.1441 4.9007 3.8263 19.0457 5.5600 3.0119 68.8557 0.4728 30.8700 43.1840 223.6070 38.6353 46.9670 7.5523 49.5789 17.1319 5.9556 121.8001 22.2452 9.2230 45.4514 1.1923 1.8198 66.1523 11.6603 21.3332 22.6626 28.7131 7.7353 13.2637 5.2654 3.3061 10.5109 14.5393 12.4974 148.9974 127.8459 44.7213 19.0524 1.0613 1.4788 34.8689 20.2357 18.0508 2.7680 1.7941 6.7009 7.6919 48.0479 71.8190 28.5590 42.5922 13.4570
temp: 298.150 k
press: 1.00000 atm
elementType: 8 8 8 6 6 6 6 6 6 6 6 6 1 1 1 1 1 1 1 1 1 1 1 1 1 1 1 1
symmnumber: 1
zpe: 617405.3 jmol-1
zpe.correction: 0.235157 hartree
zpe.thermalcorrener: 0.250378 hartree
zpe.thermalcorrenthalpy: 0.251322 hartree
zpe.thermalcorrgfe: 0.190631 hartree
zpe.sumelectzpe: -577.261885 hartree
zpe.sumelectthermal: -577.246664 hartree
zpe.sumelectthermalent: -577.245720 hartree
zpe.sumelectthermalfe: -577.306411 hartree
dipole: 3.2022 -1.5541 -2.3027
dipole: 4.2393
quadrupole: -71.3654 -72.3267 -75.5508
quadrupole: 1.6583 1.4192 -5.9076
quadrupole: 1.7156 0.7542 -2.4698 1.6583 1.4192 -5.9076
hfenergy: -577.497042 hartree
pointgroup: C01 [X(C9H16O3)]
dipole: 1.3008136 0.493195 0.9200209 debye
polarizability: 126.7534659|-2.2683482|107.6390579|5.0329852|-0.1373912|86.3458799 unknown
InChI: InChI=1S/C9H16O3/c1-4-6-8(7(3)10)9(11)12-5-2/h8H,4-6H2,1-3H3
charge 0 multiplicity 1
28 atoms
O  1.813326 0.24851 0.417791
O  -2.66887 -1.19725 -0.234272
O  1.020728 -1.308501 -1.125025
C  -0.56602 -0.078203 0.340025
C  -1.113586 1.159683 -0.431077
C  -2.214103 1.912436 0.351269
C  -1.541067 -1.283217 0.312465
C  0.801517 -0.480052 -0.210867
C  -2.747047 3.130993 -0.431981
C  -1.070704 -2.565867 0.980855
C  3.203872 0.023606 -0.095981
C  4.12468 0.924753 0.719279
H  -0.413781 0.20701 1.401547
H  -0.276882 1.855285 -0.637226
H  -1.5186 0.819315 -1.402019
H  -3.046759 1.217947 0.56462
H  -1.804965 2.247285 1.326837
H  -1.936705 3.85067 -0.656533
H  -3.194146 2.815483 -1.392995
H  -3.525414 3.666621 0.141566
H  -0.400011 -3.100638 0.281231
H  -1.93253 -3.213449 1.205098
H  -0.494064 -2.363929 1.901692
H  3.444719 -1.048585 0.019571
H  3.215792 0.264477 -1.174288
H  5.168098 0.799527 0.37696
H  3.845798 1.985604 0.600508
H  4.078727 0.670488 1.791948
