program: Gaussian 09
title: 000095332
version: EM64L-G09RevD.01
frameworkgroup: C1[X(C9H10O3)]
method: RPBEPBE
basis: SDD
operation: Freq
keyword: #pfreq=noraman
keyword: PBEPBE/SDD
title: #p freq=noraman PBEPBE/SDD
converged: YES YES NO NO
title: Mulliken charges:
elementType: O O O C C C C C C C C C H H H H H H H H H H
charge: -0.193109 -0.153841 -0.153364 -0.295531 -0.251178 -0.106027 -0.483163 0.164114 -0.202357 0.167196 -0.196997 -0.723422 0.285723 0.288369 0.241490 0.222287 0.260472 0.220900 0.218502 0.254511 0.220046 0.215379
chargesum: 0.00000
title: Mulliken charges with hydrogens summed into heavy atoms:
elementType: O O O C C C C C C C C C
charge: -0.193109 -0.153841 -0.153364 -0.009807 0.037190 0.135463 -0.000404 0.164114 0.018543 0.167196 0.021505 -0.033486
polarizability: 1.00438484e+02 -9.89974809e+00 1.17250807e+02 5.85309650e-01 -9.45002671e-01 7.15436399e+01
1716.lowfreq: -18.1954 -12.6190 -9.5828 -0.0003 0.0006 0.0008 56.1164 63.2855 139.7858
frequency: 55.8587 63.2009 139.7849 174.1496 223.6357 233.7500 300.7213 312.3579 343.8995 402.9908 460.2626 490.3089 520.3018 564.3830 607.9284 659.7936 705.1692 710.9731 750.0201 792.3701 809.1841 858.9012 896.2487 905.3394 957.6826 978.7352 983.2687 1042.3966 1061.5523 1091.1495 1110.9781 1119.8904 1134.3282 1203.0718 1212.4463 1229.0342 1245.3467 1280.0707 1293.2242 1313.4058 1325.7429 1347.9430 1375.0951 1400.3711 1467.1813 1477.5106 1483.0733 1682.8982 1701.7814 1769.7625 2941.2565 2969.5638 2980.9403 2983.8854 3020.5389 3068.4349 3080.0975 3090.7064 3101.1497 3132.6626
redmass: 2.9093 5.1107 14.5106 4.8409 3.4908 1.0711 2.9003 2.6412 6.3140 5.2216 5.7240 2.6779 5.3813 7.1898 5.7342 4.8360 1.6983 4.5918 4.9651 5.6780 6.0202 2.1670 3.3283 2.4307 1.6781 1.5240 1.8444 2.0318 2.6674 2.6188 7.8351 1.6212 1.7453 1.1273 1.2106 1.2765 1.5347 1.4088 1.3531 1.7209 1.3544 1.4837 1.5806 1.2173 1.0830 1.0522 1.0456 7.0306 12.6515 12.5748 1.0823 1.0753 1.0679 1.0362 1.0986 1.0871 1.0992 1.0999 1.0844 1.0990
irintensity: 1.0578 0.4092 3.4564 3.1881 3.1883 0.1405 2.3954 1.8199 3.7390 3.2125 3.3869 8.3783 18.1146 7.0085 3.3299 27.3128 35.2333 14.3905 26.7579 67.9882 164.6331 20.7907 19.5030 46.9466 5.3706 5.4213 15.0225 21.6018 30.3784 1.5842 141.1599 22.2945 2.5464 7.0735 1.8120 0.8578 0.1980 6.9114 0.5805 3.8384 4.1502 4.6220 2.1341 18.5654 20.1684 10.5201 11.4247 9.8888 469.8965 87.3413 12.6065 12.6260 20.5527 22.1991 12.2420 4.4875 33.4506 13.9770 4.7612 37.8571
temp: 298.150 k
press: 1.00000 atm
elementType: 8 8 8 6 6 6 6 6 6 6 6 6 1 1 1 1 1 1 1 1 1 1
symmnumber: 1
zpe: 452420.0 jmol-1
zpe.correction: 0.172318 hartree
zpe.thermalcorrener: 0.182810 hartree
zpe.thermalcorrenthalpy: 0.183754 hartree
zpe.thermalcorrgfe: 0.135939 hartree
zpe.sumelectzpe: -573.730760 hartree
zpe.sumelectthermal: -573.720268 hartree
zpe.sumelectthermalent: -573.719324 hartree
zpe.sumelectthermalfe: -573.767139 hartree
dipole: -3.9093 -2.8176 2.2717
dipole: 5.3275
quadrupole: -76.5026 -77.9672 -68.2578
quadrupole: -1.0104 7.0069 -3.4043
quadrupole: -2.2601 -3.7247 5.9847 -1.0104 7.0069 -3.4043
hfenergy: -573.9030781 hartree
pointgroup: C01 [X(C9H10O3)]
dipole: 1.8433606 -0.4836822 -0.8725168 debye
dipolederiv: -0.569389 -0.111039 0.1611452 -0.1355032 -1.6587089 0.2788579 0.2647838 0.2789184 -0.3370597 -0.5121274 0.2032142 0.00045 0.1590865 -1.1163461 0.170983 0.0621188 0.0906146 -0.3220509 -0.5421598 -0.2249629 0.1715684 -0.1889692 -0.9100049 0.2025567 0.2348353 0.2992358 -0.456399 -0.3447642 0.1244894 0.0290984 0.163102 -0.1043676 -0.058425 -0.0689125 0.0107679 0.100435 -0.1170207 0.0054505 0.1441467 -0.0658139 -0.0414259 0.0255751 0.2659048 -0.0262188 -0.0686052 0.1489621 0.0382955 -0.0257676 0.1164247 0.04762 0.005296 0.1349205 -0.079191 0.1785604 0.007055 -0.0507764 -0.0696227 -0.1075 -0.0084228 -0.0131237 -0.0725619 0.009228 0.1500976 1.0566525 0.2118515 -0.2465076 -0.1073342 1.7440777 -0.3572221 -0.3392653 -0.4812088 0.3749629 0.0375384 -0.1715309 0.0360468 -0.1749624 -0.0153678 0.0448343 0.0129836 0.1146581 -0.1806129 0.7193705 -0.1584974 -0.307414 0.1923828 1.7674527 -0.3340665 -0.5103237 -0.2115848 0.5595251 0.1534901 0.0848506 0.1553191 0.0461161 0.0219085 0.0825281 0.1547271 0.0539638 -0.145235 0.0013998 0.0210111 -0.0103191 -0.0144084 -0.0466647 0.0047637 -0.0530122 -0.0139435 0.0839628 0.0528304 -0.0413164 0.0609845 -0.0203793 0.0416721 0.0518736 0.0477192 0.0456422 -0.0224754 -0.0058985 -0.0127799 -0.0639385 -0.0160036 0.0697845 -0.0013914 -0.0849114 -0.0118379 -0.0120502 -0.01105 0.0462093 0.1113586 -0.006622 -0.0075112 0.0083407 0.0721976 0.0166611 -0.0613899 0.0221591 0.0148938 0.010744 0.044625 0.0542745 -0.0590822 0.0103992 -0.1369533 -0.1034806 0.0547554 -0.104405 -0.0020247 -0.0157988 0.000148 0.0405608 0.0043329 0.085734 0.0611905 -0.1013132 -0.0041699 -0.0953623 -0.020608 0.0514606 -0.0489007 -0.1015966 -0.0257396 0.1045971 -0.0642084 0.1099508 -0.0410931 0.1056232 -0.0202943 -0.0138487 -0.0455619 -0.0227975 0.1354686 0.0160898 0.1331445 0.0127645 0.0783513 -0.0271492 -0.0053935 0.0161349 0.0118988 0.0990214 -0.0299218 -0.0734345 -0.1169855 -0.0323167 0.0808771 -0.0002361 -0.1258687 -0.0430918 -0.0482852 0.0275498 -0.0404488 0.0854089 0.0005081 0.0769875 -0.0244798 0.1209567 0.0352444 -0.0901776 unknown
polarizability: 95.9830486|1.8607581|121.658556|0.6019192|1.746011|71.5913257 unknown
InChI: InChI=1S/C9H10O3/c1-5-3-2-4-6-7(5)9(11)12-8(6)10/h2-3,5-7H,4H2,1H3
charge 0 multiplicity 1
22 atoms
O  -2.007398 0.383656 0.324161
O  -1.426672 2.526465 -0.419457
O  -1.946845 -1.91682 0.756506
C  0.169629 0.603612 -0.696589
C  -0.305138 -0.870028 -0.835649
C  1.224874 0.82363 0.446092
C  0.755122 -1.986085 -0.696327
C  -1.114303 1.33882 -0.317717
C  2.265205 -0.285098 0.432422
C  -1.462493 -0.948947 0.167962
C  2.052547 -1.528349 -0.064883
C  1.874355 2.223391 0.331228
H  0.58407 1.005165 -1.635686
H  -0.796358 -0.967048 -1.826859
H  0.693319 0.776956 1.422548
H  0.974358 -2.420058 -1.691132
H  0.318055 -2.814549 -0.102413
H  3.237387 -0.036818 0.879997
H  2.856961 -2.274418 -0.02201
H  1.112336 3.022131 0.329321
H  2.556445 2.401755 1.182019
H  2.464046 2.305636 -0.600536
