program: Gaussian 09
title: 000095315
version: EM64L-G09RevD.01
frameworkgroup: C1[X(C7H14O2)]
method: RPBEPBE
basis: SDD
operation: Freq
keyword: #pfreq=noraman
keyword: PBEPBE/SDD
title: #p freq=noraman PBEPBE/SDD
converged: NO YES NO NO
title: Mulliken charges:
elementType: O O C C C C C C C H H H H H H H H H H H H H H
charge: -0.420008 -0.232079 -0.028371 -0.365108 -0.477512 -0.368654 -0.728767 -0.695384 0.163805 0.227722 0.187731 0.208784 0.232198 0.230705 0.204835 0.195176 0.208724 0.212865 0.226825 0.215792 0.211529 0.211247 0.377945
chargesum: 0.00000
title: Mulliken charges with hydrogens summed into heavy atoms:
elementType: O O C C C C C C C
charge: -0.042063 -0.232079 0.199352 0.031408 -0.014609 0.031356 -0.080352 -0.056817 0.163805
polarizability: 8.66051866e+01 -3.34662603e+00 8.36137557e+01 -5.34558309e-01 1.01712161e+00 7.47836352e+01
1716.lowfreq: -0.0002 0.0006 0.0008 3.7124 12.9535 18.9528 26.1943 60.9676 76.0981
frequency: 25.8461 60.8462 76.0564 95.3714 142.3835 188.9539 219.8930 236.8374 300.8302 358.2524 385.3421 418.6383 435.6586 544.9652 602.6208 674.4978 735.5957 821.2522 824.1654 850.9938 900.6827 921.2113 949.3800 993.1964 1039.0109 1052.0645 1087.2430 1126.7799 1143.6280 1159.3288 1202.2164 1246.1283 1267.6729 1289.9128 1295.5853 1303.2750 1330.4978 1341.2924 1359.3807 1388.1206 1390.7708 1442.9319 1459.0971 1473.9426 1475.9487 1478.6649 1483.8545 1487.8271 1662.2201 2953.7377 2971.7966 2973.2536 2974.3504 2989.3356 3002.9372 3005.7281 3031.9643 3064.3124 3070.3661 3073.0333 3081.9575 3083.3611 3511.3292
redmass: 8.4512 2.5500 2.1559 2.5230 2.6839 2.6100 1.1296 1.2051 2.4530 2.7682 2.9795 3.2259 2.0518 3.3240 1.4655 2.5556 1.1225 2.2728 3.3478 1.3354 1.8480 1.7892 1.7851 1.2977 2.4525 1.8549 2.2791 2.2817 2.2053 1.7372 1.4284 1.3332 1.2958 1.2840 1.1370 2.0189 1.3535 1.4614 1.5478 1.2076 1.2143 1.0919 1.0775 1.0606 1.0429 1.0551 1.0544 1.0722 8.3505 1.0595 1.0554 1.0391 1.0394 1.0861 1.0631 1.0928 1.1019 1.0993 1.1007 1.0995 1.0990 1.0994 1.0639
irintensity: 0.8837 0.1047 0.0483 0.0757 0.0976 0.0890 0.0430 0.0546 0.4699 1.2341 2.2408 4.0982 1.3975 42.0379 89.1470 69.9907 7.2084 3.6119 18.9948 6.0736 0.2127 10.9369 18.1778 16.6538 17.0054 120.9985 4.9875 12.1903 40.2311 30.5797 4.5215 1.8790 4.8022 1.6838 1.3205 38.8900 5.1991 6.0253 2.8469 6.5837 19.9216 13.3366 1.3723 1.3852 14.9134 7.1490 6.4496 19.3009 239.9833 14.1545 53.7277 32.2171 26.8124 5.1605 13.5498 10.3010 36.5972 29.3065 83.1048 46.4844 38.1189 35.5712 20.9471
temp: 298.150 k
press: 1.00000 atm
elementType: 8 8 6 6 6 6 6 6 6 1 1 1 1 1 1 1 1 1 1 1 1 1 1
symmnumber: 1
zpe: 523595.5 jmol-1
zpe.correction: 0.199427 hartree
zpe.thermalcorrener: 0.210700 hartree
zpe.thermalcorrenthalpy: 0.211644 hartree
zpe.thermalcorrgfe: 0.161264 hartree
zpe.sumelectzpe: -424.856868 hartree
zpe.sumelectthermal: -424.845596 hartree
zpe.sumelectthermalent: -424.844651 hartree
zpe.sumelectthermalfe: -424.895031 hartree
dipole: -0.9309 1.1311 1.2709
dipole: 1.9394
quadrupole: -57.6340 -55.8588 -58.3049
quadrupole: 1.3244 4.8597 -5.4046
quadrupole: -0.3682 1.4071 -1.0390 1.3244 4.8597 -5.4046
hfenergy: -425.0562954 hartree
pointgroup: C01 [X(C7H14O2)]
dipole: 0.3822791 0.4580768 -0.4756215 debye
dipolederiv: -0.4478547 0.0469865 -0.1749944 0.0172812 -0.3006915 -0.1301594 -0.1811242 -0.0477147 -1.1655587 -0.4872944 -0.2125034 0.1441643 -0.3059548 -0.696342 0.3164617 0.0174396 0.0848669 -0.7432354 0.2578927 0.0857152 0.0072695 0.0010707 0.1155218 -0.0087069 -0.0536109 -0.0932089 0.1112236 -0.0239475 0.0249477 0.0342748 0.0546772 0.0131839 0.039246 0.0538558 0.047578 0.1281667 -0.1884383 -0.1982599 0.0102582 -0.2022574 -0.2007057 -0.0500361 0.0377683 0.0193839 0.0734605 0.0592572 0.0411535 0.0230261 0.0666023 0.0908176 0.0338406 -0.018393 0.0430565 0.1442625 -0.0386185 -0.0686989 -0.0032848 -0.0253286 -0.0599137 -0.0233848 0.0185154 0.0258989 0.1021855 -0.001649 0.0691748 -0.0070891 0.0561386 0.0089397 0.022717 0.0191926 0.0136957 0.0802101 0.5245042 0.3964439 0.0609097 0.5901736 0.9056401 -0.1518503 0.1890715 -0.0519495 1.4827889 0.0435859 -0.0032668 -0.0066116 0.0068889 0.0281175 -0.0334222 -0.0140862 -0.0084379 -0.1379828 0.0282866 0.0195068 -0.0095582 0.0032646 0.0609923 -0.0367586 -0.0108039 -0.003328 -0.1776774 -0.0056631 -0.0816485 -0.0085655 -0.1093335 -0.1430084 -0.0194916 -0.0165445 -0.0332608 0.054731 -0.0050746 0.084327 -0.0235027 0.0967753 -0.0375712 0.0290348 -0.0691765 0.0371163 0.0759116 0.0694821 -0.0214952 -0.03564 -0.0339281 0.0708643 0.0078831 0.0074982 -0.0263711 -0.0991616 -0.0111524 -0.0950604 -0.0101189 -0.1112609 -0.1377467 -0.0258176 -0.0181767 -0.0484381 0.0573517 0.0367171 0.023736 -0.0588566 0.017818 0.055339 0.021048 -0.0120509 0.0233993 -0.1919647 0.087748 -0.0159789 -0.0162091 -0.0131032 0.0690016 0.0261698 -0.0427174 -0.0602648 -0.1625545 -0.0119081 0.1622931 -0.0552593 0.1068123 -0.0920647 0.0416749 -0.0523642 0.0533364 0.0662181 -0.1364646 -0.0768503 0.0879208 -0.0597043 0.0899599 -0.007479 0.094771 0.0068877 0.0406925 -0.1800058 0.0618132 0.0979472 0.0359304 0.0665938 0.0064565 0.1197957 -0.0099499 0.0447919 0.0892234 0.0090664 -0.0157344 0.0121902 0.065103 -0.0173747 -0.0675456 0.0311319 -0.1772774 0.0206641 -0.1349393 -0.0427556 -0.064384 -0.1164482 -0.037212 -0.0434627 -0.0478781 0.0707014 0.3207096 -0.1164629 0.0024096 -0.1403686 0.1444176 -0.0028395 0.0421487 0.0444502 0.3227165 unknown
polarizability: 86.7388257|3.3187602|83.5579484|-0.2229637|-0.596456|74.7058034 unknown
InChI: InChI=1S/C7H14O2/c1-3-4-6(2)5-7(8)9/h6,8H,3-5H2,1-2H3
charge 0 multiplicity 1
23 atoms
O  -2.167467 -0.489339 -1.338281
O  -2.420455 -1.287654 0.824821
C  0.179308 0.961401 -0.180525
C  1.070757 -0.209696 0.310888
C  -1.251499 0.865481 0.435897
C  2.461128 -0.280759 -0.362067
C  0.784477 2.343819 0.158188
C  3.260658 -1.529537 0.068408
C  -1.991283 -0.398517 0.055949
H  0.072142 0.880786 -1.28095
H  1.196775 -0.133512 1.411885
H  0.545868 -1.170069 0.127401
H  -1.848884 1.730017 0.088388
H  -1.195979 0.900706 1.537851
H  3.046127 0.627611 -0.118782
H  2.331226 -0.284922 -1.463872
H  0.927822 2.454246 1.250635
H  0.125254 3.163692 -0.182909
H  1.766496 2.483221 -0.326456
H  4.252177 -1.562493 -0.419145
H  3.421277 -1.539587 1.163023
H  2.720649 -2.457568 -0.198033
H  -2.659973 -1.329728 -1.545514
