program: Gaussian 09
title: 000095279
version: EM64L-G09RevD.01
frameworkgroup: C1[X(C8H14O5S2)]
method: RPBEPBE
basis: SDD
operation: Freq
keyword: #p
keyword: freq=noraman
keyword: PBEPBE/SDD
title: #p freq=noraman PBEPBE/SDD
converged: YES YES NO NO
title: Mulliken charges:
elementType: S S O O O O O C C C C C C C C H H H H H H H H H H H H H H
charge: 0.966224 0.966224 -0.281987 -0.560481 -0.561918 -0.560481 -0.561917 -0.027563 -0.027563 -0.598190 -0.598190 -0.428024 -0.428024 -0.557585 -0.557586 0.241697 0.241697 0.275059 0.289199 0.275058 0.289199 0.288297 0.233721 0.288297 0.233721 0.285549 0.295009 0.285549 0.295010
chargesum: 0.00000
title: Mulliken charges with hydrogens summed into heavy atoms:
elementType: S S O O O O O C C C C C C C C
charge: 0.966224 0.966224 -0.281987 -0.560481 -0.561918 -0.560481 -0.561917 0.214134 0.214134 -0.033933 -0.033933 0.093994 0.093994 0.022973 0.022973
polarizability: 1.76183215e+02 -1.22094374e+00 1.39693669e+02 7.07919993e-05 2.77573748e-04 1.23933216e+02
1716.lowfreq: -11.1813 -2.0044 -0.0008 0.0014 0.0023 15.1126 22.4792 33.5733 38.2269
frequency: 14.5484 33.5122 38.2145 78.1919 113.3428 123.8117 141.7266 202.9982 215.6779 248.6088 258.1926 273.4483 279.4668 280.2347 284.5645 303.0986 368.6307 384.7723 407.0244 462.9315 469.5921 523.1160 524.9858 542.6561 546.6748 647.2131 717.0483 782.8555 803.7719 808.5992 820.7990 841.5249 841.6151 857.9233 864.5970 887.1400 920.5547 941.2762 943.5233 946.9032 977.1965 984.1321 999.9013 1062.0888 1063.1130 1086.7861 1097.0673 1113.9748 1135.9886 1153.5010 1159.8869 1177.4204 1178.5444 1247.0548 1248.6740 1256.6111 1274.9937 1289.0981 1316.7670 1328.3438 1334.1909 1408.5917 1410.8051 1414.9926 1416.7636 1442.5448 1443.5911 2978.3258 2984.1073 3024.4802 3024.5706 3063.9364 3064.3786 3077.5176 3077.6537 3093.0836 3093.1383 3161.0271 3161.1921 3178.5868 3178.7151
redmass: 8.2022 5.7702 7.4573 5.3669 4.0102 6.0197 8.6541 4.0067 4.6404 3.6353 2.8799 7.9774 4.7311 6.2110 3.6917 3.2174 2.3408 2.6457 3.4368 6.9013 5.6056 7.0823 7.2356 4.3118 4.7087 2.9167 2.0539 1.8777 12.1689 8.7338 2.3230 2.1700 2.1846 3.1433 3.2487 2.7285 3.2025 1.5434 3.1039 1.5289 2.1754 1.8389 2.7132 1.7577 1.5244 1.1857 1.0919 1.5002 1.7349 1.4354 1.4397 1.4211 1.4033 1.2761 1.2395 1.3364 1.5716 1.3172 1.4018 1.3517 1.3119 1.1072 1.1063 1.0966 1.0972 1.0938 1.0956 1.0837 1.0844 1.0607 1.0608 1.0566 1.0566 1.0572 1.0572 1.1032 1.1032 1.1112 1.1112 1.1131 1.1131
irintensity: 15.0202 10.7474 0.2279 0.0004 3.9999 1.1665 0.9863 0.0028 3.5696 1.4815 0.2528 28.6609 7.0348 5.6562 14.4628 8.4228 8.3377 15.4205 5.6328 8.8826 2.4752 64.2811 13.7269 5.9277 8.8550 7.5855 0.2641 2.0032 151.5151 3.4659 43.8790 1.6403 7.0681 4.6226 6.2276 0.2216 70.8736 4.6922 13.2492 0.7578 87.7161 2.2820 166.2320 5.4765 0.6920 35.5327 1.7002 12.2938 0.6331 31.1920 0.0067 24.2502 10.8108 3.1779 1.6319 7.7250 0.5571 89.3054 13.2725 4.6054 4.0778 13.5851 32.4174 24.4325 14.9087 25.7274 0.0056 22.8492 23.9900 24.6692 4.4187 0.7241 2.7677 3.3163 1.2892 5.6315 3.7028 1.7849 0.2084 1.0390 0.0102
temp: 298.150 k
press: 1.00000 atm
elementType: 16 16 8 8 8 8 8 6 6 6 6 6 6 6 6 1 1 1 1 1 1 1 1 1 1 1 1 1 1
symmnumber: 1
zpe: 573781.1 jmol-1
zpe.correction: 0.218542 hartree
zpe.thermalcorrener: 0.234915 hartree
zpe.thermalcorrenthalpy: 0.235859 hartree
zpe.thermalcorrgfe: 0.172889 hartree
zpe.sumelectzpe: -1483.960837 hartree
zpe.sumelectthermal: -1483.944464 hartree
zpe.sumelectthermalent: -1483.943520 hartree
zpe.sumelectthermalfe: -1484.006490 hartree
dipole: 0.0000 -0.0001 3.0585
dipole: 3.0585
quadrupole: -165.5768 -106.5980 -93.6894
quadrupole: -22.2560 -0.0004 -0.0002
quadrupole: -43.6221 15.3568 28.2653 -22.2560 -0.0004 -0.0002
hfenergy: -1484.1793791 hartree
pointgroup: C01 [X(C8H14O5S2)]
dipole: 0.0000056 -0.0000199 1.2033113 debye
polarizability: 176.1981588|0.9722129|139.6787256|0.000054|0.0002813|123.9332162 unknown
InChI: InChI=1S/C8H14O5S2/c9-14(10)3-1-7(5-14)13-8-2-4-15(11,12)6-8/h7-8H,1-6H2
charge 0 multiplicity 1
29 atoms
S  3.175316 0.489974 -0.097943
S  -3.175346 -0.489942 -0.097957
O  -0.000015 0.000009 0.136799
O  2.77166 1.960991 -0.6865
O  4.730112 0.113489 0.243782
O  -2.771696 -1.960943 -0.68656
O  -4.73014 -0.113462 0.24378
C  0.964364 -0.806422 0.901522
C  -0.964391 0.806419 0.901547
C  2.072261 0.080327 1.474399
C  -2.072288 -0.080346 1.474398
C  1.575426 -1.772355 -0.149807
C  -1.575452 1.772385 -0.149751
C  2.36825 -0.948927 -1.170037
C  -2.368276 0.948988 -1.170007
H  0.46115 -1.380844 1.705902
H  -0.461176 1.380815 1.705945
H  1.750482 1.058044 1.858291
H  2.748881 -0.440796 2.168004
H  -1.75051 -1.058076 1.858259
H  -2.748909 0.440755 2.168019
H  0.753123 -2.316565 -0.644714
H  2.22809 -2.502448 0.361107
H  -0.75315 2.316611 -0.644641
H  -2.228118 2.502461 0.361186
H  3.2245 -1.459985 -1.630031
H  1.740098 -0.417196 -1.896912
H  -3.224524 1.460061 -1.629988
H  -1.740123 0.417278 -1.896896
