program: Gaussian 09
title: 000095346
version: EM64L-G09RevD.01
frameworkgroup: C1[X(C20H27N)]
method: RPBEPBE
basis: SDD
operation: Freq
keyword: #pfreq=noraman
keyword: PBEPBE/SDD
title: #p freq=noraman PBEPBE/SDD
converged: NO YES NO NO
title: Mulliken charges:
elementType: N C C C C C C C C C C C C C C C C C C C C H H H H H H H H H H H H H H H H H H H H H H H H H H H
charge: -0.030725 0.184991 -0.118266 0.296812 -0.475221 -0.542737 -0.469256 0.329218 -0.416897 -0.588475 -0.771346 0.271478 -0.756815 -0.423100 -0.232655 -0.579718 0.583317 -0.522150 -0.242007 -0.689327 -0.699415 0.184982 0.202435 0.191525 0.216120 0.222143 0.199751 0.221244 0.246240 0.196173 0.251910 0.224354 0.208903 0.233023 0.223935 0.231736 0.232154 0.217195 0.221686 0.232931 0.229153 0.206410 0.213806 0.206552 0.231795 0.225059 0.210560 0.210522
chargesum: 0.00000
title: Mulliken charges with hydrogens summed into heavy atoms:
elementType: N C C C C C C C C C C C C C C C C C C C C
charge: -0.030725 0.184991 0.066716 0.296812 -0.081261 -0.104474 -0.048261 0.329218 0.025515 -0.112211 -0.105485 0.271478 -0.075731 -0.201415 -0.232655 -0.346787 0.583317 -0.292997 -0.035598 -0.037174 -0.053273
polarizability: 2.55449204e+02 -1.06238353e+01 1.91408495e+02 -1.05455451e+01 -1.00069415e+01 1.79575532e+02
1716.lowfreq: -26.2804 -11.4907 -0.0005 -0.0004 0.0005 4.3470 23.1590 32.7667 51.1746
frequency: 23.1109 31.8993 50.3873 75.2299 108.9300 134.9418 147.6345 163.5469 180.1465 190.5370 208.6542 211.4347 218.8954 234.9826 243.9073 263.6638 279.1323 279.9296 322.0051 333.5251 345.5723 360.2411 372.4373 390.6066 421.4008 438.8494 456.1390 461.3036 474.2954 514.7625 520.6612 539.4708 579.9077 597.7577 611.9838 643.6989 659.3867 697.8561 734.1023 755.8352 807.1881 810.2726 832.5428 846.2375 855.5246 877.4406 893.4312 905.4907 911.8088 917.8553 929.5513 949.9866 951.8479 955.7955 966.0087 973.2181 1009.9169 1029.2618 1041.0503 1058.6025 1071.4945 1076.4923 1093.7825 1098.5085 1112.2081 1113.2111 1134.5114 1142.7182 1156.2902 1169.2432 1180.5769 1189.6595 1206.0539 1214.8941 1224.9327 1239.5737 1257.0161 1268.0251 1292.2596 1307.3444 1308.6181 1321.2336 1322.5327 1331.9403 1340.8563 1345.5205 1354.0806 1359.2867 1376.0636 1380.0856 1380.6078 1384.7363 1394.8931 1419.2308 1456.2691 1460.7706 1464.2390 1465.8296 1465.9444 1467.6507 1468.3721 1471.7908 1476.5784 1478.5171 1482.3943 1484.8884 1500.2203 1502.9555 1580.0239 1621.0891 2172.7000 2946.6846 2963.6347 2968.7807 2971.7237 2972.8373 2975.6462 2976.7116 2977.0139 2985.7839 2988.1888 3006.5729 3020.1359 3036.8016 3039.5831 3048.5802 3051.5175 3062.0350 3064.9988 3072.1030 3076.1789 3081.9274 3082.2753 3084.9106 3100.4524 3103.2589 3112.8966 3143.4802
redmass: 3.0535 3.8808 4.3096 3.4878 3.7467 3.9332 5.6250 3.1276 2.4804 1.1936 1.7795 1.1569 1.5086 1.6629 1.1830 2.8500 2.9879 2.3524 2.9463 2.7473 2.8185 2.3704 2.8754 3.6269 3.1280 2.7973 3.2220 3.1544 2.9008 4.4446 3.0828 3.0372 3.7605 3.6673 2.8668 3.1227 3.3529 4.7121 3.0320 3.5249 2.3344 1.9431 1.4489 3.0763 1.6315 2.1626 1.8219 2.2081 1.6722 1.2143 2.1613 1.6430 1.5686 1.5264 1.9640 1.5706 2.7218 1.9420 1.6049 2.1166 1.7138 1.6840 1.6960 3.9733 2.2030 2.5329 2.1980 2.0928 1.6834 1.6621 1.3412 1.5695 2.3779 1.5800 1.6514 2.3062 1.5859 1.3475 1.5433 1.3305 1.4283 1.4478 1.7111 1.4427 1.4908 1.8552 1.4489 1.3954 1.1968 2.2300 1.3918 1.2629 1.2194 2.7927 1.0768 1.0778 1.1110 1.0597 1.0461 1.0517 1.0817 1.0681 1.1181 1.0482 1.0796 1.0852 1.3592 1.4911 6.7533 6.3946 12.6294 1.0823 1.0580 1.0466 1.0614 1.0350 1.0490 1.0601 1.0697 1.0363 1.0615 1.0717 1.0899 1.0957 1.0960 1.1035 1.1008 1.0978 1.1000 1.0992 1.1003 1.0997 1.0996 1.0984 1.0991 1.0901 1.0874 1.0940
irintensity: 0.4014 0.8748 1.6811 0.0771 0.1676 1.6487 4.0486 1.6517 0.2561 0.0804 1.3481 0.1144 0.5339 0.0746 0.0724 0.8408 1.6564 0.2117 0.3872 0.1999 0.1362 0.3099 0.7007 0.1357 0.3617 4.9530 0.4553 0.4140 1.7730 0.6989 0.2969 0.5017 0.3974 1.7989 7.1856 3.8091 1.6572 0.4850 2.8680 0.8155 0.3358 0.1003 25.8352 4.7163 7.3988 0.8790 2.4578 8.5495 11.6839 0.4080 3.0218 1.7848 0.4710 0.8568 2.8543 13.0168 2.3671 4.4718 5.1113 3.5033 9.9828 13.6106 3.9308 12.2608 2.9310 1.6819 3.4406 1.4178 1.6773 0.1345 4.8037 6.3253 1.9128 4.4961 1.7681 0.2816 0.7549 0.9754 0.6171 0.9850 2.4686 6.4402 9.8423 2.2115 1.6984 1.7806 0.9526 0.6829 15.7594 12.8844 6.2842 13.7560 9.2262 9.1837 3.9041 4.7388 1.4498 11.8936 1.9945 4.0957 11.5105 12.5988 30.0765 16.0874 7.6339 9.9677 24.1137 26.8162 2.1494 7.2872 9.3475 22.3122 7.3055 64.8134 45.6670 31.4340 28.3376 28.1825 23.4910 29.1822 22.6721 39.5417 40.2977 34.5321 39.8124 37.8354 44.4701 53.5533 1.2682 112.3419 26.6667 26.3778 32.7275 28.7613 22.8224 24.4595 18.0642 24.5599
temp: 298.150 k
press: 1.00000 atm
elementType: 7 6 6 6 6 6 6 6 6 6 6 6 6 6 6 6 6 6 6 6 6 1 1 1 1 1 1 1 1 1 1 1 1 1 1 1 1 1 1 1 1 1 1 1 1 1 1 1
symmnumber: 1
zpe: 1096408.7 jmol-1
zpe.correction: 0.417600 hartree
zpe.thermalcorrener: 0.438369 hartree
zpe.thermalcorrenthalpy: 0.439313 hartree
zpe.thermalcorrgfe: 0.369205 hartree
zpe.sumelectzpe: -831.499787 hartree
zpe.sumelectthermal: -831.479018 hartree
zpe.sumelectthermalent: -831.478074 hartree
zpe.sumelectthermalfe: -831.548182 hartree
dipole: -2.4774 2.0749 1.8476
dipole: 3.7224
quadrupole: -113.0052 -132.6617 -128.3323
quadrupole: -0.4251 -1.4852 -8.9733
quadrupole: 11.6612 -7.9953 -3.6659 -0.4251 -1.4852 -8.9733
hfenergy: -831.9173869 hartree
pointgroup: C01 [X(C20H27N1)]
dipole: -0.959904 0.8822972 0.6670427 debye
polarizability: 255.0416667|-12.3490162|190.1807372|-10.1341786|-10.5966518|181.2108272 unknown
InChI: InChI=1S/C20H27N/c1-14(2)15-6-8-17-16(12-15)7-9-18-19(3,13-21)10-5-11-20(17,18)4/h6,8,12,14,18H,5,7,9-11H2,1-4H3
charge 0 multiplicity 1
48 atoms
N  -0.841884 -2.506099 -1.196441
C  -1.347276 1.346734 0.343002
C  -2.207374 0.166598 0.930342
C  -2.701623 -0.904514 -0.128934
C  -2.065885 1.931769 -0.91151
C  -1.503554 -0.441042 2.169996
C  -3.374775 -0.17557 -1.341063
C  0.10883 0.896252 0.080961
C  -2.444907 0.877956 -1.968551
C  -0.079744 -0.964956 1.871778
C  -1.2853 2.505759 1.392563
C  0.710074 -0.131788 0.864948
C  -3.75042 -1.857962 0.52431
C  0.925044 1.574067 -0.860203
C  -1.624817 -1.761082 -0.688831
C  2.077765 -0.444203 0.678009
C  2.891755 0.229493 -0.261495
C  2.286395 1.250786 -1.033429
C  4.36638 -0.134931 -0.453129
C  4.527194 -1.579108 -0.999892
C  5.184352 0.05442 0.852178
H  -3.157506 0.628918 1.279379
H  -1.452606 2.733127 -1.361915
H  -2.995538 2.427112 -0.558791
H  -2.113167 -1.252083 2.608839
H  -1.449888 0.344814 2.945452
H  -4.295884 0.315868 -0.96496
H  -3.685441 -0.929727 -2.088274
H  -1.536189 0.389232 -2.370146
H  -2.953551 1.364548 -2.822642
H  -0.133915 -2.000159 1.482769
H  0.488136 -1.032778 2.820553
H  -2.301662 2.78525 1.733431
H  -0.678961 2.241088 2.274893
H  -0.819806 3.39737 0.933621
H  -4.197794 -2.516867 -0.240817
H  -3.303783 -2.498376 1.302225
H  -4.558483 -1.258729 0.982905
H  0.498842 2.373652 -1.475276
H  2.510399 -1.251574 1.284362
H  2.885173 1.795063 -1.774598
H  4.782752 0.558121 -1.212402
H  4.13518 -2.321004 -0.279594
H  5.593688 -1.811234 -1.18047
H  3.975133 -1.709894 -1.947607
H  5.097538 1.088507 1.232009
H  6.254668 -0.162605 0.676286
H  4.829234 -0.628619 1.646458
