program: Gaussian 09
title: 000095211
version: EM64L-G09RevD.01
frameworkgroup: C1[X(C4H6F3NO2)]
method: RPBEPBE
basis: SDD
operation: Freq
keyword: #p
keyword: freq=noraman
keyword: PBEPBE/SDD
title: #p freq=noraman PBEPBE/SDD
converged: NO YES NO NO
title: Mulliken charges:
elementType: F F F O O N C C C C H H H H H H
charge: -0.182844 -0.140995 -0.137139 -0.443550 -0.206887 -0.372712 -0.343933 -0.313219 0.172483 0.322134 0.241042 0.245659 0.352272 0.233004 0.230730 0.343953
chargesum: 0.00000
title: Mulliken charges with hydrogens summed into heavy atoms:
elementType: F F F O O N C C C C
charge: -0.182844 -0.140995 -0.137139 -0.099596 -0.206887 -0.020440 0.142769 0.150515 0.172483 0.322134
polarizability: 6.79658650e+01 1.62676853e+00 5.74529153e+01 5.05403694e+00 4.13790074e+00 4.85570306e+01
1716.lowfreq: -0.0007 0.0003 0.0006 1.5031 6.9363 10.4237 23.0421 41.7476 63.1459
frequency: 22.4664 41.6983 63.1437 115.3804 193.6121 220.6635 253.2160 273.4788 302.8487 364.1656 375.9902 438.6990 502.2062 523.9847 628.8999 638.0213 712.4070 774.3982 854.7842 875.1736 990.8244 1010.1683 1032.4845 1043.1245 1077.7386 1141.1574 1180.0755 1242.7583 1277.1785 1330.5071 1348.8182 1372.6895 1437.0861 1464.0884 1495.1326 1654.8771 2998.5408 3021.7332 3088.5350 3098.2517 3549.4975 3575.0135
redmass: 10.5729 6.8183 6.9305 2.6779 5.7342 5.3161 1.1307 9.6885 6.9965 3.0811 10.0371 13.5565 5.3562 3.4202 1.3376 5.3821 8.8389 3.9226 2.7719 2.6317 2.9623 5.6854 3.8694 11.0004 2.1538 5.7400 1.3100 2.1058 1.3496 1.1765 1.2842 1.2100 1.1107 1.0817 1.8165 9.6294 1.0644 1.0603 1.1007 1.1048 1.0784 1.0665
irintensity: 0.2596 9.0794 4.1278 7.9536 4.5220 8.3663 199.8989 7.4640 2.1405 15.6197 4.9864 6.6080 0.8102 1.1886 72.2213 25.4203 7.0827 22.0109 37.6881 28.9604 38.7392 216.7184 59.4431 257.0136 4.0029 158.1337 25.8920 14.6296 3.2063 8.1346 6.2960 19.0444 25.5063 6.7948 103.3988 223.6692 28.7503 17.5790 19.8532 18.3144 58.8193 7.6218
temp: 298.150 k
press: 1.00000 atm
elementType: 9 9 9 8 8 7 6 6 6 6 1 1 1 1 1 1
symmnumber: 1
zpe: 284744.2 jmol-1
zpe.correction: 0.108453 hartree
zpe.thermalcorrener: 0.119260 hartree
zpe.thermalcorrenthalpy: 0.120204 hartree
zpe.thermalcorrgfe: 0.069968 hartree
zpe.sumelectzpe: -659.949961 hartree
zpe.sumelectthermal: -659.939155 hartree
zpe.sumelectthermalent: -659.938210 hartree
zpe.sumelectthermalfe: -659.988446 hartree
dipole: -2.0390 -1.0752 -1.8090
dipole: 2.9302
quadrupole: -66.6900 -60.8415 -55.4031
quadrupole: -5.9891 1.1657 -2.3151
quadrupole: -5.7118 0.1367 5.5751 -5.9891 1.1657 -2.3151
hfenergy: -660.0584145 hartree
pointgroup: C01 [X(C4H6F3N1O2)]
dipole: 0.8105589 -0.3967726 0.7173272 debye
dipolederiv: -0.4526701 -0.0659859 -0.0034381 -0.0450396 -0.7375153 0.2601066 -0.028693 0.2353783 -0.4441089 -0.4419825 -0.0816301 -0.162294 -0.0852682 -0.3123334 -0.1546765 -0.1308589 -0.1230142 -0.7327792 -0.7087503 0.1991816 0.177569 0.1426142 -0.4229397 -0.1207967 0.1448358 -0.1376866 -0.3632643 -0.2717432 0.1075005 0.2233989 0.2074383 -0.7480653 -0.0973752 0.2331194 -0.0601472 -0.5589493 -0.5259271 -0.0847079 -0.0070996 0.2578387 -0.7503371 0.2894124 -0.2038286 0.2188463 -0.4767807 -0.9055629 0.2284456 -0.1670864 0.1953804 -0.5170666 0.0750103 -0.1608565 0.0978259 -0.5923556 0.4375915 0.0891083 0.0623892 0.1610186 0.1292975 0.0674501 0.1154915 -0.0550033 0.1518987 0.2679123 -0.0707027 -0.0798384 -0.1688374 0.6426423 0.0526405 -0.1428276 0.1439447 0.312051 0.8498217 -0.1214391 0.28465 -0.4048611 0.8589312 -0.5019 0.4550539 -0.470306 0.4799796 1.4818417 -0.1369869 -0.0156143 -0.0875664 1.373703 0.0635362 -0.0009579 0.0652867 1.5396718 -0.0044438 -0.0009171 -0.0385571 -0.0029371 0.0970114 0.0962231 -0.0552028 0.0466473 -0.0609863 0.0295178 0.0727486 0.0192604 -0.0293968 -0.0703852 -0.0601468 0.0144508 -0.0087473 0.1002195 0.2076644 -0.0114943 -0.0405931 -0.0576634 0.2343242 0.0385998 -0.0444319 0.0385346 0.307282 -0.1110878 -0.0929252 -0.0195506 -0.0489619 -0.0057126 -0.0236834 0.0036145 -0.0456999 0.1022372 0.0494323 0.0819001 -0.0888506 0.0477246 -0.0359873 0.036007 -0.0430709 0.0455389 -0.0889947 0.0983861 -0.1120955 -0.1443451 -0.0814829 0.2644329 -0.0204074 -0.1558378 0.0086019 0.324879 unknown
polarizability: 68.0658356|-1.4439601|57.1831797|4.9718292|-4.3487032|48.7267956 unknown
InChI: InChI=1S/C4H6F3NO2/c5-4(6,7)3(10)8-1-2-9/h8-9H,1-2H2
charge 0 multiplicity 1
16 atoms
F  -1.62689 -1.469667 0.723114
F  -2.087088 -0.591123 -1.322359
F  -2.756618 0.496525 0.548717
O  3.205969 -1.17569 -0.452903
O  -0.285604 1.647803 -0.61019
N  0.629047 -0.06527 0.706253
C  1.961393 0.559859 0.835431
C  2.877807 0.252876 -0.36709
C  -0.372052 0.548298 -0.002982
C  -1.710735 -0.245164 -0.015413
H  2.427649 0.176074 1.75853
H  1.827203 1.653324 0.925346
H  0.438648 -0.951787 1.17875
H  3.843373 0.764009 -0.219801
H  2.417109 0.627793 -1.302158
H  2.444988 -1.66396 -0.855646
