program: Gaussian 09
title: 000095267
version: EM64L-G09RevD.01
frameworkgroup: C1[X(C17H26O2)]
method: RPBEPBE
basis: SDD
operation: Freq
keyword: #pfreq=noraman
keyword: PBEPBE/SDD
title: #p freq=noraman PBEPBE/SDD
converged: YES YES NO NO
title: Mulliken charges:
elementType: O O C C C C C C C C C C C C C C C C C H H H H H H H H H H H H H H H H H H H H H H H H H H
charge: -0.236019 -0.241363 0.375349 -0.481410 -0.425146 -0.419596 -0.394166 -0.382076 0.063981 -0.740284 -0.347862 -0.629196 -0.698872 0.487689 -0.385295 -0.385274 -0.233823 -0.233783 -0.244781 0.190409 0.204424 0.185292 0.236038 0.235038 0.187850 0.261834 0.192993 0.201244 0.208105 0.189035 0.224359 0.213362 0.221785 0.193528 0.194937 0.217913 0.218234 0.211540 0.210198 0.217445 0.236426 0.236944 0.220038 0.220126 0.222830
chargesum: 0.00000
title: Mulliken charges with hydrogens summed into heavy atoms:
elementType: O O C C C C C C C C C C C C C C C C C
charge: -0.236019 -0.241363 0.375349 -0.086577 -0.003816 0.003293 0.060660 0.027273 0.253016 -0.080779 0.040603 -0.193049 -0.059689 0.487689 -0.148868 -0.148330 -0.013784 -0.013657 -0.021951
polarizability: 1.97092729e+02 -1.74377071e+01 1.76973052e+02 -5.48181754e+00 -1.49068745e+00 1.68719747e+02
1716.lowfreq: -17.8126 -6.5964 -0.0005 0.0005 0.0006 2.6678 6.2045 23.7970 28.2709
frequency: 1.0798 23.6609 27.6299 35.1412 48.9786 69.2759 82.5541 114.4194 131.8637 178.4594 190.7970 205.0705 220.8344 232.4620 252.0190 273.0138 277.4908 299.4923 325.5051 349.2837 372.2971 402.8728 436.1696 451.2949 467.2422 504.0545 510.3957 526.1957 617.6874 637.1590 683.0540 700.9184 724.4807 728.3950 756.2341 762.9216 775.7108 786.0153 794.8855 849.5056 883.2797 891.3458 898.0609 923.0698 930.1628 944.9835 952.3976 966.0814 971.5646 975.1872 988.2115 992.2603 997.8443 1014.9214 1027.3805 1035.8954 1058.6931 1071.7664 1079.3226 1080.4237 1084.9464 1101.2935 1167.7604 1170.2075 1175.4227 1179.8131 1188.4353 1201.9104 1215.4208 1219.5977 1232.6618 1259.6916 1273.7996 1289.6268 1290.4287 1304.2721 1319.5161 1321.7845 1328.9044 1338.7651 1346.1912 1350.0547 1354.8292 1361.1697 1368.0207 1384.6530 1390.3348 1390.6574 1440.8465 1449.7480 1456.0872 1457.3030 1465.4482 1468.2715 1473.8008 1476.7470 1477.4624 1484.8356 1485.3250 1487.8500 1490.6571 1595.0868 1615.7949 2865.2813 2912.1928 2923.4793 2948.4182 2961.1244 2971.1022 2973.2693 2979.4023 2984.2772 2994.0808 3005.3671 3012.6198 3036.8915 3045.8118 3068.8073 3069.6324 3071.3883 3072.3607 3074.3727 3077.3245 3079.2134 3117.7200 3125.7201 3138.5994 3147.2477 3161.2991
redmass: 3.5110 3.0445 2.5097 2.4177 3.1120 2.6698 3.8399 2.6466 2.2083 3.9046 3.2087 2.6142 1.1503 3.3000 2.6907 2.5161 2.6850 2.3422 2.2325 1.9407 2.0989 2.7928 2.4955 2.8627 3.4457 3.8724 4.9034 4.7976 6.2384 4.5661 3.4206 1.5766 1.0919 2.7979 3.0675 1.4041 2.4058 1.3407 2.5152 1.2505 2.0668 1.8016 1.7078 1.7481 1.5707 2.2938 6.6049 2.1920 1.4765 2.8112 1.5864 3.4405 1.9841 1.6278 2.2298 2.8711 2.9246 1.7957 2.1004 2.9239 1.5784 2.1109 2.1108 1.0654 1.8209 1.8401 1.1299 1.2889 2.2095 1.4150 1.2592 1.2766 1.3546 1.1649 1.2197 1.4172 1.1630 1.6198 1.2550 1.4506 1.2811 1.4457 1.3983 1.5081 1.3603 7.2035 1.2160 1.2194 2.1604 1.0812 1.1081 1.0828 1.0728 1.0699 1.0650 1.0476 1.0691 1.0707 2.3345 1.0492 1.0776 6.1077 6.1619 1.0823 1.0690 1.0691 1.0610 1.0586 1.0598 1.0370 1.0365 1.0666 1.0929 1.1007 1.0603 1.1037 1.0957 1.1004 1.1018 1.0976 1.0993 1.0975 1.0951 1.0949 1.0841 1.0876 1.0925 1.0967 1.1016
irintensity: 0.0147 0.0353 0.0620 0.1102 0.1111 0.3176 0.7795 0.2919 0.4314 2.0222 0.4701 1.1192 0.2421 3.6346 1.6601 0.4552 1.1863 1.3023 0.7646 1.9763 1.3981 0.0017 1.4358 0.8412 3.0688 4.4995 4.1798 13.4352 0.0625 1.1260 12.7616 77.6188 8.3946 8.1371 17.1854 6.2009 14.5541 5.8084 45.1418 0.5746 9.1941 9.5066 1.1737 6.9141 3.0695 4.1154 22.6970 19.5291 3.0928 32.5596 0.0525 0.3027 25.5870 17.6105 8.6114 2.3979 2.1728 6.2437 1.1162 154.3257 17.3466 17.7958 2.1278 0.1402 17.2777 4.5705 0.4080 3.3787 3.4869 3.8939 4.4827 2.1753 5.4598 7.1837 0.9783 14.8630 1.7200 11.1009 0.3910 1.6407 3.8012 10.1958 20.4780 2.3151 0.1922 0.2171 16.1993 13.2535 7.6333 7.0824 13.3700 4.0088 0.6694 5.5233 3.8705 17.0036 16.9439 10.6668 15.5614 7.2257 6.3043 0.5234 5.1181 92.6694 27.6933 109.1660 46.5159 11.7435 50.3306 42.3585 31.0601 22.8323 21.9965 0.8565 37.0047 55.7114 0.0740 66.8840 14.4091 32.9361 60.9082 39.1410 57.2860 20.7106 1.1440 2.0715 29.6082 43.5004 15.8660
temp: 298.150 k
press: 1.00000 atm
elementType: 8 8 6 6 6 6 6 6 6 6 6 6 6 6 6 6 6 6 6 1 1 1 1 1 1 1 1 1 1 1 1 1 1 1 1 1 1 1 1 1 1 1 1 1 1
symmnumber: 1
zpe: 1030354.4 jmol-1
zpe.correction: 0.392441 hartree
zpe.thermalcorrener: 0.412518 hartree
zpe.thermalcorrenthalpy: 0.413462 hartree
zpe.thermalcorrgfe: 0.338512 hartree
zpe.sumelectzpe: -812.355507 hartree
zpe.sumelectthermal: -812.335431 hartree
zpe.sumelectthermalent: -812.334487 hartree
zpe.sumelectthermalfe: -812.409437 hartree
dipole: 2.6773 -0.8080 0.2645
dipole: 2.8090
quadrupole: -117.6785 -110.0716 -114.9904
quadrupole: -2.9151 -0.2715 -0.2467
quadrupole: -3.4317 4.1752 -0.7435 -2.9151 -0.2715 -0.2467
hfenergy: -812.7479484 hartree
pointgroup: C01 [X(C17H26O2)]
dipole: 1.0579764 0.3160899 -0.0462976 debye
polarizability: 197.2388042|16.3616678|176.826191|8.1013937|-0.2353734|168.7205332 unknown
InChI: InChI=1S/C17H26O2/c1-3-5-11-17(4-2)13-18-16(19-14-17)12-15-9-7-6-8-10-15/h6-10,16H,3-5,11-14H2,1-2H3
charge 0 multiplicity 1
45 atoms
O  -0.525287 1.377959 -1.129288
O  -0.242803 1.012978 1.248909
C  1.606859 0.335798 -0.306532
C  3.147559 0.434953 -0.50947
C  0.932287 1.28104 -1.340868
C  1.222909 0.900501 1.091298
C  1.058885 -1.117511 -0.435837
C  4.014676 -0.462653 0.404465
C  -0.815582 1.87119 0.215374
C  1.363589 -1.831845 -1.769841
C  5.528069 -0.268421 0.154618
C  -2.338303 1.913885 0.403736
C  6.405022 -1.172131 1.047547
C  -3.020675 0.559939 0.268669
C  -3.488434 0.107395 -0.991041
C  -3.195088 -0.278089 1.399022
C  -4.11716 -1.15176 -1.119423
C  -3.822886 -1.538145 1.27532
C  -4.288414 -1.979209 0.014727
H  3.458144 1.492552 -0.363347
H  3.383369 0.193646 -1.566754
H  1.383523 2.298059 -1.266632
H  1.050874 0.916456 -2.373888
H  1.538952 0.233227 1.909123
H  1.686811 1.904088 1.237318
H  -0.034913 -1.08214 -0.282194
H  1.468759 -1.719597 0.39979
H  3.798474 -0.249164 1.471102
H  3.757041 -1.527882 0.240289
H  -0.361485 2.890054 0.317092
H  0.921014 -1.299479 -2.631422
H  2.449597 -1.935124 -1.952201
H  0.930478 -2.848655 -1.762024
H  5.793779 0.794785 0.327785
H  5.749893 -0.473296 -0.912952
H  -2.734286 2.623617 -0.345203
H  -2.525431 2.3442 1.404351
H  6.186496 -2.241389 0.865996
H  6.219726 -0.970357 2.119548
H  7.481396 -1.010129 0.854788
H  -3.343903 0.740198 -1.87406
H  -2.822703 0.054949 2.374445
H  -4.472832 -1.48641 -2.10088
H  -3.949204 -2.173997 2.159306
H  -4.778892 -2.954686 -0.08256
