program: Gaussian 09
title: 000009350
version: EM64L-G09RevD.01
frameworkgroup: C1[X(C20H15F)]
method: RPBEPBE
basis: SDD
operation: Freq
keyword: #pfreq=noraman
keyword: PBEPBE/SDD
title: #p freq=noraman PBEPBE/SDD
converged: YES YES NO NO
title: Mulliken charges:
elementType: F C C C C C C C C C C C C C C C C C C C C H H H H H H H H H H H H H H H
charge: -0.212519 0.280052 0.280428 0.226812 -0.456734 0.446571 -0.383014 -0.398584 -0.407461 -0.396996 -0.545843 -0.380570 -0.232263 -0.227171 -0.235024 -0.223130 -0.245658 -0.246488 0.317561 -0.199477 -0.396641 0.228865 0.256060 0.256313 0.247180 0.262067 0.260193 0.264870 0.227202 0.228495 0.226934 0.229153 0.230578 0.229715 0.232192 0.256334
chargesum: 0.00000
title: Mulliken charges with hydrogens summed into heavy atoms:
elementType: F C C C C C C C C C C C C C C C C C C C C
charge: -0.212519 0.280052 0.280428 0.226812 -0.227869 0.446571 -0.126954 -0.142271 -0.160281 -0.134929 -0.285651 -0.115700 -0.005061 0.001324 -0.008090 0.006022 -0.015079 -0.016773 0.317561 0.032715 -0.140308
polarizability: 3.32381151e+02 -8.33627624e+00 2.37673682e+02 -3.07893038e+00 -1.76867670e-01 1.30551673e+02
1716.lowfreq: -9.3383 -6.4380 -0.0006 -0.0001 0.0004 5.6942 24.6308 36.9600 50.7424
frequency: 23.9750 36.7829 50.7305 63.4300 68.1905 76.3597 149.7717 166.8548 213.6299 222.2114 237.0042 256.8261 289.2658 329.1072 400.4297 404.0286 409.2080 446.0869 461.3613 477.4048 499.5635 546.9895 585.6375 591.8811 610.4921 615.5713 644.7089 655.0092 689.1027 702.8624 704.9943 727.2650 746.5976 773.4668 779.6252 788.3054 852.8099 857.4232 858.3642 891.0561 893.9629 907.0692 925.4807 933.3353 946.2297 975.5071 978.7253 981.4372 984.9685 988.4583 989.1665 996.3310 996.9787 1025.3286 1029.8408 1080.8154 1081.8978 1086.4307 1129.2904 1155.0333 1172.5841 1173.2312 1179.5200 1190.1855 1194.0595 1238.8916 1264.3269 1298.4314 1314.1807 1320.0231 1357.4761 1369.3822 1377.0588 1393.7981 1425.2896 1431.9189 1437.1721 1475.1750 1480.3931 1485.2711 1574.8979 1578.9026 1580.4104 1598.7373 1607.1549 1611.7678 1617.0113 3093.4626 3123.4772 3124.3074 3130.4361 3131.2670 3142.8333 3143.3923 3143.7041 3151.3784 3152.1422 3154.9048 3165.4223 3165.8648 3173.1508 3182.6186
redmass: 5.6636 4.5566 4.7821 4.3921 4.8092 4.2428 5.6228 5.1093 4.8081 6.1942 5.0368 4.7283 4.5325 4.6505 4.5320 3.0398 2.9102 3.2861 3.5531 3.8529 8.6133 5.8819 4.5386 4.8490 5.6683 6.4065 3.8437 5.9690 2.2560 1.7172 1.7508 3.7548 5.0346 2.0060 2.1647 1.4532 1.2485 1.3547 1.3102 1.4279 1.7132 2.8419 1.6914 1.6684 2.7722 1.3443 1.4535 1.4213 5.6951 5.0122 5.5533 1.3368 1.3128 2.3779 2.0505 1.5756 1.5891 1.6030 1.8352 2.5345 1.0537 1.0532 1.1686 1.1161 1.1212 2.1989 3.6072 1.5279 1.3920 1.3611 2.4590 6.5545 7.0628 2.9213 2.9475 2.2877 2.3404 2.3247 2.4408 2.3848 6.2192 5.7356 5.8751 6.4405 6.1059 6.4563 7.2910 1.0875 1.0845 1.0846 1.0874 1.0877 1.0922 1.0920 1.0885 1.0961 1.0965 1.0922 1.1015 1.1016 1.0926 1.0984
irintensity: 0.4847 0.0218 0.3043 0.0776 0.2830 0.1694 1.5307 0.0992 0.2494 0.1418 0.1175 0.2495 1.0331 0.2875 0.6627 0.2773 0.3244 1.3989 10.7115 0.4107 3.6692 9.5436 3.9837 16.8899 1.2037 0.1186 5.8953 4.2519 27.4837 57.9829 41.7007 13.0946 32.3154 19.6536 36.6293 47.8731 0.4602 0.8242 0.6073 22.8233 13.7548 25.8628 8.3641 16.3045 15.2934 1.8380 1.1501 0.0951 1.6797 0.0022 0.7251 0.2074 0.3084 5.5502 10.4791 4.8650 10.5993 6.8168 20.1270 20.8032 0.0106 0.0798 4.5230 0.4104 1.8956 33.2448 10.8460 1.7881 0.6127 2.6929 6.4747 1.2510 1.4154 8.9753 5.9235 12.1479 24.8885 18.8782 39.5939 14.4229 35.0248 3.5552 24.9848 24.4721 4.0470 44.0531 20.6115 22.5422 3.3158 1.3286 0.9851 1.4323 18.7766 13.0822 15.0575 34.5662 30.3238 2.3954 32.1216 17.4071 4.0049 6.0024
temp: 298.150 k
press: 1.00000 atm
elementType: 9 6 6 6 6 6 6 6 6 6 6 6 6 6 6 6 6 6 6 6 6 1 1 1 1 1 1 1 1 1 1 1 1 1 1 1
symmnumber: 1
zpe: 741184.0 jmol-1
zpe.correction: 0.282302 hartree
zpe.thermalcorrener: 0.299260 hartree
zpe.thermalcorrenthalpy: 0.300204 hartree
zpe.thermalcorrgfe: 0.235686 hartree
zpe.sumelectzpe: -869.535625 hartree
zpe.sumelectthermal: -869.518667 hartree
zpe.sumelectthermalent: -869.517723 hartree
zpe.sumelectthermalfe: -869.582241 hartree
dipole: 2.1210 1.7846 -0.7791
dipole: 2.8793
quadrupole: -121.2732 -110.9517 -121.5340
quadrupole: -10.3465 2.4215 1.6866
quadrupole: -3.3536 6.9679 -3.6144 -10.3465 2.4215 1.6866
hfenergy: -869.8179266 hartree
pointgroup: C01 [X(C20H15F1)]
dipole: 0.6113702 0.9062192 -0.2970448 debye
polarizability: 329.7006984|17.8295005|240.3722404|-2.4077853|0.0422971|130.5335673 unknown
InChI: InChI=1S/C20H15F/c21-19-13-7-8-16(14-19)15-20(17-9-3-1-4-10-17)18-11-5-2-6-12-18/h1-15H
charge 0 multiplicity 1
36 atoms
F  -4.336104 -3.636701 0.677896
C  0.76243 -0.185993 -0.025962
C  2.234397 -0.451172 -0.031676
C  0.326631 1.247237 0.024991
C  -0.114926 -1.251697 -0.017724
C  -1.582242 -1.282599 -0.180316
C  3.136396 0.424226 0.63809
C  0.834978 2.195181 -0.904789
C  2.776688 -1.585443 -0.702787
C  -0.571824 1.697799 1.030462
C  -2.281448 -2.417787 0.326284
C  -2.333556 -0.289131 -0.878477
C  4.522061 0.160188 0.660527
C  0.432976 3.548022 -0.850494
C  4.162217 -1.848552 -0.681551
C  -0.965921 3.051367 1.092151
C  5.043189 -0.979058 0.003723
C  -0.470121 3.981961 0.148111
C  -3.669404 -2.506062 0.155709
C  -3.728146 -0.41651 -1.038335
C  -4.426406 -1.531338 -0.514887
H  0.333303 -2.245583 0.125541
H  2.743001 1.305978 1.155288
H  1.540974 1.864841 -1.675095
H  2.109667 -2.243711 -1.270877
H  -0.953642 0.97985 1.764273
H  -1.749434 -3.21636 0.854187
H  -1.819406 0.573975 -1.308039
H  5.195508 0.841551 1.192522
H  0.825879 4.261915 -1.58314
H  4.557397 -2.722438 -1.211781
H  -1.655184 3.38106 1.877605
H  6.120045 -1.180797 0.016424
H  -0.777769 5.032608 0.195189
H  -4.28282 0.354747 -1.583181
H  -5.507583 -1.649471 -0.628659
