program: Gaussian 09
title: 000095187
version: EM64L-G09RevD.01
frameworkgroup: C1[X(C6H7N5)]
method: RPBEPBE
basis: SDD
operation: Freq
keyword: #p
keyword: freq=noraman
keyword: PBEPBE/SDD
title: #p freq=noraman PBEPBE/SDD
converged: NO YES NO NO
title: Mulliken charges:
elementType: N N N N N C C C C C C H H H H H H H
charge: -0.441422 -0.027163 0.023276 -0.056750 -0.630391 0.137489 -0.103595 0.196283 0.138361 -0.777692 -0.397514 0.300398 0.235341 0.235235 0.280651 0.243965 0.339564 0.303965
chargesum: 0.00000
title: Mulliken charges with hydrogens summed into heavy atoms:
elementType: N N N N N C C C C C C
charge: -0.141024 -0.027163 0.023276 -0.056750 0.013138 0.137489 -0.103595 0.196283 0.138361 -0.026466 -0.153549
polarizability: 1.38132211e+02 -2.37763166e+00 1.10737252e+02 -7.30830700e-03 -7.63099130e-04 4.55147164e+01
1716.lowfreq: -0.0007 -0.0002 -0.0002 5.2611 6.2473 13.4794 63.7941 127.0334 145.0692
frequency: 63.7740 127.0311 145.0646 219.1948 271.5190 273.7293 327.7675 341.0776 480.3162 516.5228 530.9680 563.0592 567.7220 568.7559 628.0803 635.9292 680.2507 783.8240 796.1290 845.7820 930.2134 949.7469 956.3549 994.2287 1048.1581 1097.8719 1184.2861 1238.1079 1289.0399 1303.0722 1329.9466 1339.8567 1375.5030 1400.4816 1426.1796 1463.4647 1469.8319 1503.4862 1546.7588 1599.1057 1633.2373 2985.6848 3061.6180 3126.4259 3163.8812 3548.2430 3584.8103 3705.2441
redmass: 1.0409 3.4873 3.5472 3.1512 1.4983 7.7867 2.7244 2.9326 7.3030 1.1501 4.1349 1.2246 4.0912 5.2055 7.6552 4.9619 6.6852 5.5753 11.8014 8.7673 1.4232 3.2614 1.9915 2.2615 1.4988 5.9535 1.9976 2.8465 9.5295 3.2734 7.6923 2.7367 2.7786 1.2660 2.1349 1.1173 1.0442 6.4824 5.5386 1.7243 2.8625 1.0394 1.0980 1.0965 1.0919 1.0457 1.0814 1.1038
irintensity: 0.0010 0.0366 0.3624 2.4193 103.8691 3.1288 47.5040 0.4326 1.3282 135.1447 4.8137 141.2396 10.7537 1.6437 1.2040 2.1542 6.8063 1.2919 6.2583 14.6283 13.1737 1.2783 13.4676 0.2633 4.6334 14.1625 4.7414 16.3037 6.6822 16.7725 108.3242 99.8520 46.8501 4.4337 8.6332 6.2493 19.6721 165.4797 70.4483 5.0522 477.3953 24.1852 16.6249 3.2847 21.0181 83.5085 29.3593 29.6160
temp: 298.150 k
press: 1.00000 atm
elementType: 7 7 7 7 7 6 6 6 6 6 6 1 1 1 1 1 1 1
symmnumber: 1
zpe: 356614.8 jmol-1
zpe.correction: 0.135827 hartree
zpe.thermalcorrener: 0.145183 hartree
zpe.thermalcorrenthalpy: 0.146127 hartree
zpe.thermalcorrgfe: 0.101221 hartree
zpe.sumelectzpe: -505.822366 hartree
zpe.sumelectthermal: -505.813011 hartree
zpe.sumelectthermalent: -505.812067 hartree
zpe.sumelectthermalfe: -505.856973 hartree
dipole: -2.0224 8.0306 -0.0008
dipole: 8.2813
quadrupole: -57.8372 -60.0030 -66.1201
quadrupole: -3.0657 -0.0030 -0.0034
quadrupole: 3.4829 1.3171 -4.8000 -3.0657 -0.0030 -0.0034
hfenergy: -505.9581937 hartree
pointgroup: C01 [X(C6H7N5)]
dipole: 0.8328784 -3.1498739 -0.0002975 debye
dipolederiv: -0.6264195 -0.0195985 0.0000191 0.0879145 -0.5429016 -0.000038 -0.0000444 -0.000001 -0.2564855 -0.7567429 0.2614631 -0.0000116 0.1684607 -0.451075 0.0000311 0.0000032 -0.000009 -0.2680733 -0.6884464 0.1025149 -0.0000223 -0.0133119 -0.5155105 -0.000012 0.0000308 0.0000094 -0.2058288 -0.5291889 0.2198373 -0.0000164 -0.1622884 -0.928374 -0.0000206 -0.0000547 -0.0000857 -0.2337046 -0.3506375 -0.3826815 -0.0001227 -0.5884234 -1.3162123 0.0001345 0.0000371 0.0004468 -0.7352346 -0.2210425 -0.5599245 -0.000045 -0.570704 -0.3360991 -0.0000195 -0.0000373 -0.0000214 0.0603777 0.8315668 -0.265497 0.0000104 0.1394446 0.3744083 0.0000009 -0.0000407 0.0000218 0.0753945 0.6723629 0.0663708 0.0000898 -0.0466362 0.7658089 -0.0000666 0.0004498 -0.0000879 0.0390146 0.725495 0.462714 0.0001093 0.6067696 1.6438185 0.0000282 0.0000842 0.0000123 0.2072029 -0.1736462 -0.0066664 0.0000239 0.0972713 0.0015212 0.0001537 -0.0005748 0.0001947 0.0788912 0.5692548 -0.0434552 0.0000065 0.0748968 0.6672476 0.0000171 0.0000116 0.0000069 -0.0753959 0.1693064 -0.0265755 -0.0000091 -0.0017739 0.124998 0.0000051 0.0000017 -0.0000037 0.347316 0.0021513 0.0186281 -0.0106263 0.0633138 0.0473856 0.1072591 -0.0791251 0.1018789 -0.0354321 0.0023443 0.01854 0.010461 0.0634258 0.0467568 -0.1076038 0.0790777 -0.1021815 -0.0349256 0.0686278 -0.0225162 0.0000661 -0.1124013 -0.0134331 0.0002493 0.0002456 0.000191 0.1345558 -0.0237114 0.0987194 -0.0000006 0.0907013 0.0055459 -0.0000006 -0.0000146 0.0000123 0.1293971 0.2210202 0.0446522 -0.0000085 0.045946 0.2070996 -0.0000498 -0.0000722 -0.0001199 0.3852666 0.107706 0.0334748 0.0000763 0.0573947 0.2190151 -0.0000679 0.0000222 -0.0002639 0.3876641 unknown
polarizability: 138.1844867|-2.053855|110.6849766|0.0072988|0.0008493|45.5147164 unknown
InChI: InChI=1S/C6H7N5/c1-3-10-4-5(7)8-2-9-6(4)11-3/h2,10H,7H2,1H3
charge 0 multiplicity 1
18 atoms
N  1.169421 -1.133283 0.000143
N  1.577504 1.11539 0.000135
N  -0.794505 1.851676 0.000063
N  -2.424818 0.011706 -0.000021
N  -1.854969 -2.264663 -0.000042
C  -0.090519 -0.514193 0.00008
C  0.18633 0.893305 0.00009
C  2.135469 -0.109093 0.000175
C  -1.445537 -0.944316 -0.000023
C  3.605674 -0.393463 0.000361
C  -2.05074 1.333548 0.000046
H  1.373169 -2.131286 0.000188
H  3.913849 -0.965516 0.89547
H  3.913625 -0.968128 -0.893143
H  4.145932 0.564713 -0.001052
H  -2.875094 2.052878 0.000022
H  -2.858091 -2.440583 -0.000158
H  -1.2071 -3.046191 -0.000537
