program: Gaussian 09
title: 000095189
version: EM64L-G09RevD.01
frameworkgroup: C1[X(C7H9N5O)]
method: RPBEPBE
basis: SDD
operation: Freq
keyword: #pfreq=noraman
keyword: PBEPBE/SDD
title: #p freq=noraman PBEPBE/SDD
converged: NO YES NO NO
title: Mulliken charges:
elementType: O N N N N N C C C C C C C H H H H H H H H H
charge: -0.210634 -0.178582 -0.430679 -0.027696 -0.056948 -0.627449 0.364977 -0.375344 -0.125585 -0.250329 -0.643883 0.017980 0.167174 0.215670 0.237794 0.265664 0.305685 0.245091 0.229119 0.216403 0.304599 0.356974
chargesum: 0.00000
title: Mulliken charges with hydrogens summed into heavy atoms:
elementType: O N N N N N C C C C C C C
charge: -0.210634 -0.178582 -0.124995 -0.027696 -0.056948 0.034124 0.364977 0.078120 -0.125585 0.015335 0.046730 0.017980 0.167174
polarizability: 1.43597991e+02 -3.86185655e-01 1.36006080e+02 6.28868748e+00 -3.97090170e+00 5.86261184e+01
1716.lowfreq: -6.4228 -0.0006 -0.0004 0.0005 4.2247 8.5102 33.3840 59.6465 70.4380
frequency: 33.1722 59.6018 70.4233 128.2179 167.3370 181.2912 208.5994 245.0029 298.1550 323.4086 355.0475 411.2960 438.1431 464.7490 481.1310 519.7594 586.8153 627.6339 642.1579 650.6836 679.9256 687.9098 749.3313 779.6293 787.5496 815.0024 928.9157 949.5459 971.5713 1026.9017 1071.6974 1087.5365 1151.2833 1184.6867 1209.4266 1254.5316 1307.2672 1320.9767 1336.4225 1344.8303 1383.9467 1397.9487 1423.7001 1468.6872 1476.1629 1489.0627 1529.6874 1539.9582 1602.2852 1623.5119 1650.6514 2990.6339 2992.7071 3060.7589 3090.9338 3102.2554 3230.2098 3536.7577 3554.6183 3706.9217
redmass: 1.7970 2.3451 3.9175 3.5525 2.0519 2.5480 3.6896 1.4651 5.2514 5.3661 3.7483 4.2680 1.2280 8.3033 4.7604 1.1432 6.1492 3.5543 4.4512 10.3380 4.8512 8.3246 1.8822 3.4131 1.2787 7.0700 6.0574 2.5397 2.1944 3.1048 2.6308 2.0021 3.2298 2.1054 1.8777 2.0524 2.3548 1.6538 5.3206 1.3383 6.1723 1.2093 4.1177 1.0422 1.1033 1.0959 4.0606 4.6026 1.5399 6.9852 4.3534 1.0565 1.0455 1.0978 1.0997 1.1012 1.0983 1.0773 1.0463 1.1051
irintensity: 8.2002 1.1018 0.2954 7.8529 1.2824 11.5832 13.2679 0.6856 1.1225 0.6157 1.9330 2.0756 308.9108 1.3379 2.5028 93.6666 3.7075 6.3899 3.7054 5.7723 9.6656 11.6233 32.5457 0.9037 5.6943 1.8232 25.8322 17.4871 56.2845 26.4141 19.6885 10.5097 24.4003 12.4962 20.3224 12.7108 45.8435 5.8953 79.1823 6.3460 124.1198 15.9971 28.0666 13.0438 14.1116 8.7393 94.3105 282.0110 9.9940 666.5430 292.7598 34.7204 19.6480 2.4002 43.9265 23.0309 0.1548 12.5147 92.5754 43.0981
temp: 298.150 k
press: 1.00000 atm
elementType: 8 7 7 7 7 7 6 6 6 6 6 6 6 1 1 1 1 1 1 1 1 1
symmnumber: 1
zpe: 438963.5 jmol-1
zpe.correction: 0.167192 hartree
zpe.thermalcorrener: 0.179417 hartree
zpe.thermalcorrenthalpy: 0.180361 hartree
zpe.thermalcorrgfe: 0.127975 hartree
zpe.sumelectzpe: -620.175498 hartree
zpe.sumelectthermal: -620.163274 hartree
zpe.sumelectthermalent: -620.162330 hartree
zpe.sumelectthermalfe: -620.214716 hartree
dipole: -8.1662 10.2688 -1.4420
dipole: 13.1990
quadrupole: -74.9200 -74.0356 -77.3617
quadrupole: 14.7881 -0.8614 -0.0550
quadrupole: 0.5191 1.4035 -1.9226 14.7881 -0.8614 -0.0550
hfenergy: -620.3426903 hartree
pointgroup: C01 [X(C7H9N5O1)]
dipole: 3.2238616 -4.0424174 -0.4813615 debye
dipolederiv: -0.8470345 0.3968429 0.0711269 0.4181597 -0.9692185 -0.0790488 0.0821327 -0.0790377 -0.3711181 -0.6961029 0.2048505 0.0040755 0.3222618 -0.4318098 0.0110394 0.0891129 -0.0209031 -0.1747671 -1.06318 -0.3377828 0.0677302 -0.0786246 -0.7333649 -0.0282351 0.0789035 0.0112461 -0.2424419 -0.3341361 0.1297397 -0.0168722 0.1525597 -0.3173921 -0.0120326 0.0256776 -0.0164779 -0.214355 -0.5905008 0.1484215 0.0336892 0.0240005 -1.6074623 -0.0752867 0.0350965 -0.0879523 -0.3246168 -0.5321031 -0.5061681 -0.0646366 -0.5700182 -1.3389069 0.0336421 -0.0575059 0.0441761 -0.7443963 0.6661309 0.0000748 -0.0232217 0.1469892 0.5840461 0.0262355 -0.0584924 0.0458871 0.0951038 0.5879651 -0.2096125 0.0464014 -0.3009394 0.3151263 0.0038714 -0.0166455 0.0142273 0.309173 -0.5191411 0.2657025 0.0563667 0.1186348 -0.2006496 0.0022569 0.0632163 -0.0485539 -0.0482567 -0.0157765 -0.1970741 -0.0268411 -0.3372129 0.5193486 0.0204043 -0.0461068 0.0470103 -0.1193842 -0.0225988 0.0400112 -0.0245984 0.0902568 -0.0006973 0.0219044 -0.0342567 0.0492586 -0.0724148 1.3924745 -0.2279906 -0.1360272 -0.3334886 1.720578 0.1202307 -0.1653095 0.1019303 0.2580213 1.5378021 0.2240449 -0.1269651 0.2639749 1.9128298 0.0680294 -0.1467157 0.0607816 0.2506914 0.0125551 -0.0269433 -0.0953622 0.0690709 -0.0740385 -0.1116607 -0.0401356 -0.0807149 -0.0407722 -0.0493203 -0.0156543 0.0543925 -0.0940736 0.0070358 0.0929009 0.0344499 0.0489054 0.0423022 -0.0211177 -0.0458721 0.0267739 -0.010134 0.1025792 -0.0042002 0.0311718 0.000211 0.1815357 0.107736 0.0384093 0.0364609 0.0235798 0.1037493 -0.0071993 0.0449643 -0.012608 0.3241955 0.1080131 -0.0225443 -0.0317334 -0.0663494 -0.0238426 -0.1064372 -0.0294943 -0.0582798 -0.0036522 -0.0881622 0.1353949 0.0126151 0.1575846 0.0081333 -0.0023881 0.009588 -0.0080918 0.0795882 -0.031609 -0.1175199 0.0779962 -0.0973635 0.0317829 0.061365 0.0452243 0.0336149 0.033859 0.1392378 0.0401952 0.0362035 0.0531253 0.190048 -0.0182561 0.0364894 -0.0213615 0.387359 0.2588685 0.0834747 0.0224257 0.048006 0.2021253 -0.0171353 0.0186353 -0.0232677 0.3943463 unknown
polarizability: 143.4797932|-0.521496|136.1654657|-7.0614215|1.7374743|58.5849301 unknown
InChI: InChI=1S/C7H9N5O/c1-2-12-3-9-4-5(12)10-7(8)11-6(4)13/h3,10H,2,8H2,1H3
charge 0 multiplicity 1
22 atoms
O  -2.555765 1.967277 0.298802
N  1.753519 0.231146 -0.349391
N  -0.13927 -1.40212 -0.172906
N  0.536852 2.158751 -0.096879
N  -2.306643 -0.367193 0.150128
N  -2.120879 -2.695956 0.005079
C  0.42463 -0.132488 -0.181867
C  2.92444 -0.657717 -0.459607
C  -0.326428 1.046328 -0.030983
C  1.759328 1.647851 -0.279796
C  3.36213 -1.246735 0.89861
C  -1.789594 0.979836 0.154678
C  -1.546444 -1.435533 -0.000839
H  2.69698 -1.464581 -1.183917
H  3.744389 -0.064136 -0.899908
H  2.681114 2.216966 -0.380808
H  0.4172 -2.250386 -0.285941
H  3.631741 -0.441686 1.603128
H  4.242515 -1.900137 0.764123
H  2.558021 -1.844793 1.363892
H  -1.600048 -3.559634 -0.118286
H  -3.130089 -2.725459 0.126886
