program: Gaussian 09
title: 000095199
version: EM64L-G09RevD.01
frameworkgroup: C1[X(C22H13NO2)]
method: RPBEPBE
basis: SDD
operation: Freq
keyword: #p
keyword: freq=noraman
keyword: PBEPBE/SDD
title: #p freq=noraman PBEPBE/SDD
converged: YES YES NO NO
title: Mulliken charges:
elementType: O O N C C C C C C C C C C C C C C C C C C C C C C H H H H H H H H H H H H H
charge: -0.155826 -0.155836 -0.017964 -0.525530 0.268388 0.000409 0.000501 0.246335 0.246280 0.279326 -0.129731 -0.387621 0.241544 -0.280173 0.425668 -0.367807 -0.367797 -0.368008 -0.448296 -0.207846 -0.207853 -0.379497 -0.433596 -0.259376 -0.243219 0.284769 0.236948 0.232528 0.277619 0.277619 0.266748 0.241711 0.239863 0.239864 0.224606 0.242883 0.230615 0.231749
chargesum: 0.00000
title: Mulliken charges with hydrogens summed into heavy atoms:
elementType: O O N C C C C C C C C C C C C C C C C C C C C C C
charge: -0.155826 -0.155836 -0.017964 -0.240761 0.268388 0.000409 0.000501 0.246335 0.246280 0.279326 -0.129731 -0.150673 0.241544 -0.047644 0.425668 -0.090189 -0.090178 -0.101260 -0.206585 0.032017 0.032011 -0.154890 -0.190713 -0.028761 -0.011470
polarizability: 3.99618033e+02 1.99859058e+01 2.34791026e+02 9.86304224e-03 4.36972952e-05 1.64467659e+02
1716.lowfreq: -0.0002 0.0005 0.0008 4.0140 4.5458 11.3074 14.5051 20.4281 34.3194
frequency: 11.1456 20.4163 34.1432 91.7531 94.0707 103.1057 120.3867 154.2909 175.5505 197.0734 224.2380 235.9239 305.2860 332.8180 333.5168 364.2385 401.2718 419.0877 431.2381 441.6827 446.1902 506.1995 516.8680 525.1824 533.3594 541.7190 545.6039 552.6664 601.4379 602.3011 633.3827 652.6563 696.6456 701.7297 718.4274 746.1038 761.5591 763.1991 769.5922 782.5649 798.4330 830.9845 834.7675 853.3507 860.6260 864.6427 891.8757 910.3554 957.1365 958.8517 966.3572 976.4004 978.9380 986.2728 989.1725 997.5568 1008.6803 1012.3498 1039.0819 1065.6909 1081.8807 1084.6645 1147.4983 1151.0539 1165.3957 1171.1261 1174.8499 1179.3267 1196.5810 1227.9848 1232.1025 1248.4244 1263.8154 1277.5793 1280.2769 1303.0046 1341.9901 1360.4969 1401.5159 1408.4843 1409.0981 1428.0792 1452.3323 1454.4256 1456.1308 1488.7504 1529.4953 1563.4654 1583.0899 1593.2915 1600.3740 1611.6994 1626.7998 1632.0905 1661.3439 3029.0798 3124.8040 3131.0272 3133.9970 3136.5417 3143.2701 3150.6905 3151.0733 3163.4659 3164.8040 3167.6592 3169.8436 3172.2790
redmass: 5.2639 6.5261 6.9431 5.8218 9.9675 3.9165 5.3758 6.8027 5.9541 6.0738 3.9481 6.9060 6.9448 7.5569 4.8964 5.7024 3.7211 3.8345 3.9835 3.6242 5.1989 5.5639 7.2073 7.2027 3.0551 3.4971 7.4226 7.3968 7.4055 3.7301 4.3598 6.6972 4.0408 6.7590 4.7247 3.2503 2.6434 1.3245 4.0348 2.0974 2.1537 1.9804 4.2950 2.1680 2.5036 4.1233 1.8323 1.4976 4.5180 1.4243 3.9346 1.5299 4.9436 1.6274 1.3394 1.3739 2.4713 1.3617 2.1733 3.0972 2.4077 2.4111 1.3365 1.3436 1.3254 1.1125 1.6747 1.0867 1.6243 1.5920 2.0059 4.2820 1.9796 3.1259 1.6187 2.4177 3.3718 3.6081 4.6478 5.3994 3.5726 3.0651 2.5297 2.5849 2.6003 3.5255 4.1571 7.1847 6.5982 7.5127 7.7550 6.5019 6.6173 10.6013 12.8183 1.0826 1.0863 1.0889 1.0882 1.0864 1.0891 1.0931 1.0903 1.0955 1.0996 1.0982 1.0965 1.1003
irintensity: 0.9555 3.5609 0.3582 0.5095 4.6658 1.0015 0.0098 0.6192 0.0699 0.2371 6.5655 0.0026 6.7320 3.8816 0.3233 0.4603 1.4138 3.2476 2.9128 3.1590 7.5343 3.4149 6.2766 0.2901 3.4793 0.9976 7.5809 1.3484 16.4513 0.1672 0.4094 22.1023 1.0416 3.4685 3.0000 5.7756 41.5306 67.2277 0.1696 34.5651 0.9866 24.1719 17.0997 35.2205 9.4463 0.4846 12.2630 0.0092 0.1502 1.3168 10.4954 0.0147 8.3629 7.5749 0.0698 0.3358 8.1230 0.0244 4.6481 56.8051 1.3670 6.5172 0.2239 0.2762 1.5966 29.0240 0.0005 0.6649 4.8487 7.9384 12.4253 333.5831 82.6333 38.2614 3.0672 30.3715 12.8605 24.6282 17.0286 16.1560 16.0796 0.2341 1.0813 14.7224 0.3991 69.6686 13.1540 4.9224 48.2603 156.3736 0.3360 15.7955 1.5591 196.1574 78.3396 4.1561 2.0355 6.4096 6.6937 1.9996 10.0117 17.2179 6.1149 5.2197 25.0602 36.4687 6.3046 27.5847
temp: 298.150 k
press: 1.00000 atm
elementType: 8 8 7 6 6 6 6 6 6 6 6 6 6 6 6 6 6 6 6 6 6 6 6 6 6 1 1 1 1 1 1 1 1 1 1 1 1 1
symmnumber: 1
zpe: 744658.6 jmol-1
zpe.correction: 0.283625 hartree
zpe.thermalcorrener: 0.301965 hartree
zpe.thermalcorrenthalpy: 0.302909 hartree
zpe.thermalcorrgfe: 0.234706 hartree
zpe.sumelectzpe: -1049.710164 hartree
zpe.sumelectthermal: -1049.691824 hartree
zpe.sumelectthermalent: -1049.690880 hartree
zpe.sumelectthermalfe: -1049.759083 hartree
dipole: -0.0652 1.5813 -0.0006
dipole: 1.5827
quadrupole: -102.2314 -124.6109 -159.2162
quadrupole: 12.6989 -0.0045 0.0037
quadrupole: 26.4548 4.0753 -30.5301 12.6989 -0.0045 0.0037
hfenergy: -1049.9937892 hartree
pointgroup: C01 [X(C22H13N1O2)]
dipole: 0.0311255 -0.6218846 -0.0008325 debye
polarizability: 399.2532282|21.4343956|235.1557634|-0.002657|0.0679678|164.4677259 unknown
InChI: InChI=1S/C22H13NO2/c24-21-16-7-3-4-8-17(16)22(25)20(21)19-12-10-15-14-6-2-1-5-13(14)9-11-18(15)23-19/h1-12,20H
charge 0 multiplicity 1
38 atoms
O  -2.481713 1.189143 -2.427393
O  -2.482341 1.184766 2.430259
N  -0.132927 -0.070667 0.000129
C  -1.972933 1.53008 0.00181
C  -0.480832 1.238273 0.001336
C  -2.69703 0.903212 -1.224602
C  -2.696633 0.900263 1.226947
C  -3.698191 -0.075548 -0.708762
C  -3.698243 -0.076956 0.709066
C  2.257834 0.595906 0.000454
C  1.208837 -0.396749 -0.000326
C  0.483471 2.28728 0.002099
C  3.655362 0.166432 -0.000029
C  1.844792 1.961431 0.001667
C  3.94943 -1.246124 -0.001312
C  -4.570874 -0.909177 -1.439145
C  -4.571113 -0.911881 1.437729
C  1.546073 -1.800873 -0.001614
C  2.866452 -2.206085 -0.002091
C  -5.442836 -1.751567 -0.713482
C  -5.442964 -1.752898 0.710339
C  4.749736 1.084901 0.000723
C  5.309327 -1.684645 -0.001802
C  6.076661 0.633358 0.000231
C  6.362357 -0.762396 -0.001045
H  -2.129768 2.624927 0.00305
H  0.155252 3.33089 0.003015
H  2.585541 2.766413 0.002272
H  -4.56055 -0.896433 -2.533477
H  -4.560822 -0.901354 2.532085
H  0.715881 -2.512882 -0.002175
H  3.118428 -3.273043 -0.003073
H  -6.131035 -2.414848 -1.248839
H  -6.131199 -2.417245 1.244325
H  4.561196 2.163198 0.001711
H  5.51619 -2.761352 -0.002788
H  6.899194 1.356739 0.000833
H  7.401688 -1.107787 -0.001425
