program: Gaussian 09
title: 000095179
version: EM64L-G09RevD.01
frameworkgroup: C1[X(C11H15Cl2NO2S2)]
method: RPBEPBE
basis: SDD
operation: Freq
keyword: #p
keyword: freq=noraman
keyword: PBEPBE/SDD
title: #p freq=noraman PBEPBE/SDD
converged: YES YES NO NO
title: Mulliken charges:
elementType: Cl Cl S S O O N C C C C C C C C C C C H H H H H H H H H H H H H H H
charge: -0.035512 -0.028879 0.491383 0.891335 -0.573083 -0.531915 -0.568834 -0.523411 -0.539024 -0.032460 -0.553047 -0.547892 -0.251536 -0.231002 0.451833 -0.364233 -0.364630 -0.800172 0.310053 0.278460 0.280262 0.347078 0.325067 0.276220 0.264716 0.288613 0.286812 0.269970 0.242127 0.240786 0.228477 0.229244 0.243192
chargesum: 0.00000
title: Mulliken charges with hydrogens summed into heavy atoms:
elementType: Cl Cl S S O O N C C C C C C C C C C C
charge: -0.035512 -0.028879 0.491383 0.891335 -0.573083 -0.531915 -0.568834 0.065102 0.088316 -0.032460 0.048240 0.005437 0.035276 0.038968 0.451833 -0.122106 -0.123843 -0.099258
polarizability: 2.80065139e+02 1.65593773e+01 2.11333265e+02 -2.02201773e+00 1.68176524e+01 1.60163828e+02
1716.lowfreq: -4.6621 -0.0020 -0.0003 0.0012 3.2590 7.7912 11.6337 16.8354 23.1882
frequency: 11.5052 16.3257 23.1584 23.9609 33.8289 42.0968 52.9810 61.5698 69.8656 101.9694 114.8038 135.0343 140.5164 147.9134 180.1902 205.8807 213.7175 229.8308 276.2675 283.8068 301.6252 313.3652 338.3728 373.1053 391.5254 406.9872 464.6268 497.0994 557.2292 573.9506 593.0586 614.7848 623.1108 631.9463 673.4474 691.2960 710.0157 772.7397 773.9879 783.3149 793.2163 825.9814 849.7253 911.3775 959.4305 961.4555 976.4726 980.9535 989.9828 996.4928 1048.6863 1058.0662 1061.9094 1065.9258 1108.6556 1117.4228 1120.8795 1183.3257 1218.7885 1226.3155 1240.0865 1257.8785 1267.2714 1285.0692 1295.3034 1300.6743 1382.3259 1392.5168 1397.7731 1426.9867 1447.0381 1462.0280 1465.9824 1470.7071 1473.9495 1474.5185 1596.1373 1597.7738 2979.9994 3036.3463 3045.7299 3060.8303 3062.6223 3076.7075 3091.9615 3125.3751 3133.3934 3133.5750 3136.5235 3150.2517 3161.5559 3164.8837 3172.0347
redmass: 1.0691 7.6814 5.9578 4.0516 7.0639 5.2497 3.3907 4.4807 2.4649 8.1948 4.1448 7.7127 5.6393 5.6373 4.3790 7.0282 6.9872 8.1462 5.4852 6.8573 5.6962 6.7324 4.7672 6.5668 5.8384 2.8765 7.9037 3.6023 7.9394 8.9794 6.3215 13.2474 6.9970 7.9069 6.1045 5.2763 3.2708 2.7286 1.3834 1.4591 3.6912 1.3885 1.2514 16.7859 1.3176 1.3526 1.3776 1.3814 1.4059 5.0819 1.5947 2.5110 4.3121 3.7333 1.0704 1.2765 1.0677 1.1440 2.9819 1.1554 1.1531 1.1725 1.1764 1.1718 1.2649 1.2032 5.9410 3.0697 1.2205 1.0978 1.0997 1.1042 1.0908 1.1003 1.5592 1.3872 6.9636 6.1092 1.0389 1.0588 1.0566 1.0562 1.0947 1.0576 1.1000 1.1105 1.1092 1.0893 1.0891 1.1113 1.0953 1.0965 1.1115
irintensity: 0.6342 1.9013 0.8068 0.1391 0.4824 1.3131 1.4782 5.3813 3.7190 2.7192 1.5038 1.0414 8.5004 1.2741 1.4485 24.8507 2.1683 10.2717 19.4188 5.8920 1.0427 10.2105 7.8024 6.9038 6.9252 0.0803 80.1866 25.6611 59.5584 23.9445 21.9055 177.5453 1.1572 84.8184 17.5308 16.3420 0.7350 13.9096 27.6855 6.6637 69.6513 28.1311 2.6545 100.2021 0.4346 1.4832 0.5864 0.4979 1.5254 2.8380 24.7020 31.5970 29.3363 3.7285 3.5481 7.5706 1.4295 14.9902 6.9111 12.2267 5.1444 4.6026 1.9970 12.2327 2.6401 6.7677 0.1938 9.3013 14.7325 7.6954 13.9847 5.1151 6.4050 16.9640 18.5327 17.1552 0.4750 11.6178 28.0476 11.3494 2.5159 14.6945 19.1768 5.2779 15.4141 6.8615 1.8024 12.6923 11.8095 4.1174 3.5707 9.2761 1.6635
temp: 298.150 k
press: 1.00000 atm
elementType: 17 17 16 16 8 8 7 6 6 6 6 6 6 6 6 6 6 6 1 1 1 1 1 1 1 1 1 1 1 1 1 1 1
symmnumber: 1
zpe: 632057.0 jmol-1
zpe.correction: 0.240738 hartree
zpe.thermalcorrener: 0.262932 hartree
zpe.thermalcorrenthalpy: 0.263876 hartree
zpe.thermalcorrgfe: 0.182352 hartree
zpe.sumelectzpe: -2347.982085 hartree
zpe.sumelectthermal: -2347.959891 hartree
zpe.sumelectthermalent: -2347.958947 hartree
zpe.sumelectthermalfe: -2348.040471 hartree
dipole: -0.6975 1.0869 -4.0738
dipole: 4.2736
quadrupole: -105.4776 -150.3421 -149.5144
quadrupole: 0.3154 -16.1123 6.1412
quadrupole: 29.6338 -15.2307 -14.4030 0.3154 -16.1123 6.1412
hfenergy: -2348.2228232 hartree
pointgroup: C01 [X(C11H15Cl2N1O2S2)]
dipole: -0.1785389 0.776991 -1.480329 debye
polarizability: 280.2024883|13.4300826|200.8945487|8.1612223|26.9125483|170.4651951 unknown
InChI: InChI=1S/C11H15Cl2NO2S2/c1-10-2-4-11(5-3-10)18(15,16)14-17(8-6-12)9-7-13/h2-5H,6-9H2,1H3
charge 0 multiplicity 1
33 atoms
Cl -3.792889 4.34013 -0.368923
Cl -4.395986 -3.174839 -1.965667
S  -2.53629 0.12953 0.631198
S  0.255831 -0.415425 1.398239
O  -0.264609 -1.969841 1.20334
O  0.450748 0.152695 2.915263
N  -0.811385 0.666832 0.298018
C  -3.286355 1.638421 -0.272565
C  -2.824734 -1.261833 -0.720037
C  1.882539 -0.173621 0.486363
C  -2.980104 2.895694 0.534278
C  -4.227073 -1.835281 -0.633693
C  2.804211 0.740372 1.019683
C  2.132835 -0.938672 -0.663637
C  4.340113 0.152957 -0.819353
C  4.03803 0.898322 0.350845
C  3.374428 -0.765103 -1.312688
C  5.683332 0.305704 -1.509614
H  -2.804037 1.662846 -1.262245
H  -4.367859 1.44437 -0.357641
H  -2.59717 -0.781146 -1.684519
H  -2.035919 -1.980227 -0.440369
H  -1.903382 3.104703 0.569644
H  -3.418994 2.884602 1.542448
H  -5.022769 -1.110341 -0.863015
H  -4.421785 -2.345079 0.320815
H  2.564421 1.290681 1.935288
H  1.390578 -1.657207 -1.025041
H  4.77512 1.607588 0.744583
H  3.596714 -1.350529 -2.212354
H  5.607672 0.110675 -2.593478
H  6.098859 1.318745 -1.370702
H  6.419811 -0.411119 -1.097466
